{"text_format":"1","workbook":"xlsx","n_sheets":35,"sheets":["Vejledning","Budget","Medarbejder 1","Medarbejder 2","Medarbejder 3","Medarbejder 4","Medarbejder 5","Medarbejder 6","Medarbejder 7","Medarbejder 8","Medarbejder 9","Medarbejder 10","Medarbejder 11","Medarbejder 12","Medarbejder 13","Medarbejder 14","Medarbejder 15","Medarbejder 16","Medarbejder 17","Medarbejder 18","Medarbejder 19","Medarbejder 20","Medarbejder 21","Medarbejder 22","Medarbejder 23","Medarbejder 24","Medarbejder 25","Medarbejder 26","Medarbejder 27","Medarbejder 28","Medarbejder 29","Medarbejder 30","Slutregnskab","Færdige regnskab","Format ark"],"not_rendered":{"charts":0,"images":0,"macros":1,"external_links":1,"defined_names":2,"comments":0,"pivot_tables":0},"unopened":[],"bounds":{"document_bytes":16777216,"sheet_cells":100000,"rows_first":2000,"rows_last":500,"rows_between":2000,"halvings":0,"cell_chars":16384,"cell_head_chars":4096},"cells_cut":0,"cells_raw":0,"read":"whole","date_system":"1900"}

{"sheet":"Vejledning","index":0,"n_rows":15,"n_cols":14,"rows_kept":15,"cut":false,"hidden":false,"merged":[]}
[]
[]
[]
[]
[]
[]
[]
[]
[]
[]
[]
[]
[]
[]
[null,null,null,null,null,null,null,null,null,null,"Tilsagn modtaget i:",null,null,{"$f":"IF(M15=\"\",\"Husk at angive hvilket år I har modtaget tilsagnet.\",\"\")","v":"Husk at angive hvilket år I har modtaget tilsagnet."}]

{"sheet":"Budget","index":1,"n_rows":1,"n_cols":1,"rows_kept":1,"cut":false,"hidden":false,"merged":[]}
["INDSÆT BUDGETSKEMA HER! VIGTIGT"]

{"sheet":"Medarbejder 1","index":2,"n_rows":63,"n_cols":6,"rows_kept":63,"cut":false,"hidden":true,"merged":[[16,1,16,2],[17,1,17,2],[33,1,33,2],[62,1,62,2],[8,4,8,5],[21,1,21,2],[9,1,9,2],[9,4,9,5],[10,1,10,2],[11,1,11,3],[12,1,12,3],[14,1,14,3],[60,5,60,6],[58,1,58,2],[47,1,47,2],[35,1,35,2],[1,1,1,3],[3,1,3,3],[5,1,5,2],[6,1,6,2],[8,1,8,2],[7,1,7,2],[60,1,60,2],[18,1,18,2],[19,1,19,2],[20,1,20,2],[34,1,34,2],[22,1,22,2],[23,1,23,2],[24,1,24,2],[25,1,25,2],[27,1,27,2],[28,1,28,2],[29,1,29,2],[30,1,30,2],[41,1,41,2],[42,1,42,2],[43,1,43,2],[31,1,31,2],[32,1,32,2],[48,1,48,2],[55,1,56,2],[55,3,56,3],[45,1,45,2],[46,1,46,2],[36,1,36,2],[37,1,37,2],[38,1,38,2],[39,1,39,2],[40,1,40,2]]}
[]
[null,"Slutregnskab for sporskiftepakken"]
[]
[null,"Oplysninger om medarbejderen"]
[]
[null,"Medarbejderens navn"]
[null,"Medarbejderens lønkompensation fra sporskifte (kr./t.)",null,{"$f":"IF(D8>261,(IF(D11=\"Ja\",260-'Format ark'!D13,260)),IF(D8<=260,IF(D11=\"Ja\",IF(D8<'Format ark'!D13,0,D8-'Format ark'!D13),D8)))","v":0}]
[null,"Medarbejderens timesats (kr./t.)"]
[null,"Medarbejderens højst gennemførte uddannelse",null,null,{"$f":"IF(D9=\"\",\"Husk at vælge medarbejderens højst gennemførte uddannelse.\",\" \")","v":"Husk at vælge medarbejderens højst gennemførte uddannelse."}]
[null,"Har medarbejderen brugt sin uddannelse de senest 5 år?",null,null,{"$f":"IF(D10=\"\",\"Husk at svare på spørgsmålet.\",\" \")","v":"Husk at svare på spørgsmålet."}]
[null,"Medarbejder formodes at være berettiget til at få VEU-godtgørelse ",null,{"$f":"IF(OR(D9=\"Videregående uddannelse\",D9=\"Gymnasial uddannelse\")*AND(D10=\"ja\"),\"Nej\",\"Ja\")","v":"Ja"}]
[null,"Beskriv herunder hvad formålet med den planlagte sporskiftepakke er for medarbejderen:"]
[]
[]
[null,"Aktiviteter"]
[]
[null,"Afklaring, vejledning mv. \nSkriv navn på kursus",null,"Medarbejderens timeforbug (timer)","Evt. deltagerbetaling (kr.)","Giver kurset ret til VEU-godtgørelse?"]
[]
[]
[]
[]
[]
[null,"Samlet antal timer (udregner selv)",null,{"$f":"SUM(D18:D22)","v":0}]
[null,"Samlet lønkompensation udover evt. VEU-godtgørelse (udregner selv)",null,{"$f":"IF(D11=\"Nej\",D23*D7,0)+IF(AND(D11=\"Ja\",F18=\"Ja\"),D18*D7,0)+IF(AND(D11=\"Ja\",F19=\"Ja\"),D19*D7,0)+IF(AND(D11=\"Ja\",F20=\"Ja\"),D20*D7,0)+IF(AND(D11=\"Ja\",F21=\"Ja\"),D21*D7,0)+IF(AND(D11=\"Ja\",F22=\"Ja\"),D22*D7,0)+IF(AND(D11=\"Ja\",F18=\"Nej\"),D18*IF(D8>261,(IF(F18=\"Ja\",260-'Format ark'!D13,260)),IF(D8<=260,IF(F18=\"Ja\",D8-'Format ark'!D13,D8))),0)+IF(AND(D11=\"Ja\",F19=\"Nej\"),D19*IF(D8>261,(IF(F19=\"Ja\",260-'Format ark'!D13,260)),IF(D8<=260,IF(F19=\"Ja\",D8-'Format ark'!D13,D8))),0)+IF(AND(D11=\"Ja\",F20=\"Nej\"),D20*IF(D8>261,(IF(F20=\"Ja\",260-'Format ark'!D13,260)),IF(D8<=260,IF(F20=\"Ja\",D8-'Format ark'!D13,D8))),0)+IF(AND(D11=\"Ja\",F21=\"Nej\"),D21*IF(D8>261,(IF(F21=\"Ja\",260-'Format ark'!D13,260)),IF(D8<=260,IF(F21=\"Ja\",D8-'Format ark'!D13,D8))),0)+IF(AND(D11=\"Ja\",F22=\"Nej\"),D22*IF(D8>261,(IF(F22=\"Ja\",260-'Format ark'!D13,260)),IF(D8<=260,IF(F22=\"Ja\",D8-'Format ark'!D13,D8))),0)","v":0}]
[null,"Estimeret VEU-godtgørelse",null,{"$f":"IF(AND(D11=\"Ja\",F18=\"Ja\"),D18*'Format ark'!D13,0)+IF(AND(D11=\"Ja\",F19=\"Ja\"),D19*'Format ark'!D13,0)+IF(AND(D11=\"Ja\",F20=\"Ja\"),D20*'Format ark'!D13,0)+IF(AND(D11=\"Ja\",F21=\"Ja\"),D21*'Format ark'!D13,0)+IF(AND(D11=\"Ja\",F22=\"Ja\"),D22*'Format ark'!D13,0)","v":0}]
[null,"Samlet deltagerbeltaing (udregner selv)",null,{"$f":"SUM(E18:E22)","v":0}]
[]
[null,"Erhversrettet efteruddannelse\nSkriv navn på efteruddannelse",null,"Medarbejderens timeforbrug (timer)","Evt. deltagerbetaling (kr.)","Giver kurset ret til VEU-godtgørelse?"]
[]
[]
[]
[]
[]
[]
[]
[]
[]
[]
[]
[]
[null,"Samlet antal timer (udregner selv)",null,{"$f":"SUM(D29:D40)","v":0}]
[null,"Samlet lønkompensation udover evt. VEU-godtgørelse (udregner selv)",null,{"$f":"IF(D11=\"Nej\",D41*D7,0)+IF(AND(D11=\"Ja\",F29=\"Ja\"),D29*D7,0)+IF(AND(D11=\"Ja\",F30=\"Ja\"),D30*D7,0)+IF(AND(D11=\"Ja\",F31=\"Ja\"),D31*D7,0)+IF(AND(D11=\"Ja\",F32=\"Ja\"),D32*D7,0)+IF(AND(D11=\"Ja\",F33=\"Ja\"),D33*D7,0)+IF(AND(D11=\"Ja\",F34=\"Ja\"),D34*D7,0)+IF(AND(D11=\"Ja\",F35=\"Ja\"),D35*D7,0)+IF(AND(D11=\"Ja\",F36=\"Ja\"),D36*D7,0)+IF(AND(D11=\"Ja\",F37=\"Ja\"),D37*D7,0)+IF(AND(D11=\"Ja\",F38=\"Ja\"),D38*D7,0)+IF(AND(D11=\"Ja\",F39=\"Ja\"),D39*D7,0)+IF(AND(D11=\"Ja\",F40=\"Ja\"),D40*D7,0)+IF(AND(D11=\"Ja\",F29=\"Nej\"),D29* IF(D8>261,(IF(F29=\"Ja\",260-'Format ark'!D13,260)),IF(D8<=260,IF(F29=\"Ja\",D8-'Format ark'!D13,D8))),0)+IF(AND(D11=\"Ja\",F30=\"Nej\"),D30* IF(D8>261,(IF(F30=\"Ja\",260-'Format ark'!D13,260)),IF(D8<=260,IF(F30=\"Ja\",D8-'Format ark'!D13,D8))),0)+IF(AND(D11=\"Ja\",F31=\"Nej\"),D31* IF(D8>261,(IF(F31=\"Ja\",260-'Format ark'!D13,260)),IF(D8<=260,IF(F31=\"Ja\",D8-'Format ark'!D13,D8))),0)+IF(AND(D11=\"Ja\",F32=\"Nej\"),D32* IF(D8>261,(IF(F32=\"Ja\",260-'Format ark'!D13,260)),IF(D8<=260,IF(F32=\"Ja\",D8-'Format ark'!D13,D8))),0)+IF(AND(D11=\"Ja\",F33=\"Nej\"),D33* IF(D8>261,(IF(F33=\"Ja\",260-'Format ark'!D13,260)),IF(D8<=260,IF(F33=\"Ja\",D8-'Format ark'!D13,D8))),0)+IF(AND(D11=\"Ja\",F34=\"Nej\"),D34* IF(D8>261,(IF(F34=\"Ja\",260-'Format ark'!D13,260)),IF(D8<=260,IF(F34=\"Ja\",D8-'Format ark'!D13,D8))),0)+IF(AND(D11=\"Ja\",F35=\"Nej\"),D35* IF(D8>261,(IF(F35=\"Ja\",260-'Format ark'!D13,260)),IF(D8<=260,IF(F35=\"Ja\",D8-'Format ark'!D13,D8))),0)+IF(AND(D11=\"Ja\",F36=\"Nej\"),D36* IF(D8>261,(IF(F36=\"Ja\",260-'Format ark'!D13,260)),IF(D8<=260,IF(F36=\"Ja\",D8-'Format ark'!D13,D8))),0)+IF(AND(D11=\"Ja\",F37=\"Nej\"),D37* IF(D8>261,(IF(F37=\"Ja\",260-'Format ark'!D13,260)),IF(D8<=260,IF(F37=\"Ja\",D8-'Format ark'!D13,D8))),0)+IF(AND(D11=\"Ja\",F38=\"Nej\"),D38* IF(D8>261,(IF(F38=\"Ja\",260-'Format ark'!D13,260)),IF(D8<=260,IF(F38=\"Ja\",D8-'Format ark'!D13,D8))),0)+IF(AND(D11=\"Ja\",F39=\"Nej\"),D39* IF(D8>261,(IF(F39=\"Ja\",260-'Format ark'!D13,260)),IF(D8<=260,IF(F39=\"Ja\",D8-'Format ark'!D13,D8))),0)+IF(AND(D11=\"Ja\",F40=\"Nej\"),D40* IF(D8>261,(IF(F40=\"Ja\",260-'Format ark'!D13,260)),IF(D8<=260,IF(F40=\"Ja\",D8-'Format ark'!D13,D8))),0)","v":0}]
[null,"Estimeret VEU-godtgørelse",null,{"$f":"IF(AND(D11=\"Ja\",F29=\"Ja\"),D29*'Format ark'!D13,0)+IF(AND(D11=\"Ja\",F30=\"Ja\"),D30*'Format ark'!D13,0)+IF(AND(D11=\"Ja\",F31=\"Ja\"),D31*'Format ark'!D13,0)+IF(AND(D11=\"Ja\",F32=\"Ja\"),D32*('Format ark'!D13),0)+IF(AND(D11=\"Ja\",F33=\"Ja\"),D33*'Format ark'!D13,0)+IF(AND(D11=\"Ja\",F34=\"Ja\"),D34*'Format ark'!D13,0)+IF(AND(D11=\"Ja\",F35=\"Ja\"),D35*'Format ark'!D13,0)+IF(AND(D11=\"Ja\",F36=\"Ja\"),D36*'Format ark'!D13,0)+IF(AND(D11=\"Ja\",F37=\"Ja\"),D37*'Format ark'!D13,0)+IF(AND(D11=\"Ja\",F38=\"Ja\"),D38*'Format ark'!D13,0)+IF(AND(D11=\"Ja\",F39=\"Ja\"),D39*'Format ark'!D13,0)+IF(AND(D11=\"Ja\",F40=\"Ja\"),D40*'Format ark'!D13,0)","v":0}]
[null,"Samlet deltagerbetaling (udregner selv)",null,{"$f":"SUM(E29:E40)","v":0}]
[]
[null,"Praktik"]
[null,"Navn på virksomhed og p-nummer"]
[null,"Medarbejderens timeforbrug",null,null,{"$f":"IF(D48>C51*0.5,\"Praktik må maksimalt udgøre 50% af det samlede tidsforbrug.\",\" \")","v":" "}]
[null,"Samlet lønkompensation for praktikopholdet",null,{"$f":"IF(D48>C51*0.5,\"IKKE MULIGT\",D48*(IF(D8>261,260,D8)))","v":0}]
[]
[null,"Samlet tidsforbrug ",{"$f":"IF(D48+D41+D23>300,\"IKKE MULIGT\",D48+D41+D23)","v":0},{"$f":"IF(C51>300,\"Det maksimale tidsforbrug er 300 timer\",\" \")","v":" "}]
[]
[null,"Tidsforbrug til administration","Antal timer","Beløb"]
[null,"Der kan godtgøres op til 5 timer.",null,{"$f":"IF(C54>5,\"Der kan maksimalt godtgøres 5 timer pr. medarbejder.\",C54*260)","v":0}]
[]
[null,"Samlet tilsagnsramme i kr. (maksimal støtte til sporskiftepakken): ",null,{"$f":"IF(AND(C51>300,D49+D44+D42+D26+D24+D54<D63+1),0,MIN(D49+D44+D42+D26+D24+D54,120000))","v":{"$error":"#REF!"}},{"$f":"IF(D56=120000,\"Det maksimale tilsagn pr. sporskiftepakke er nået, og det overstigende beløb er derfor selvbetaling.\",\"\")","v":{"$error":"#REF!"}}]
[]
[]
[null,"Estimeret VEU-godtgørelse",null,{"$f":"D43+D25","v":0}]
[]
[null,"Selvbetaling i kr. (udgifter udover den øvre tilsagnsramme)",null,{"$f":"IF(C51>300,0,MAX(D49+D54+D44+D42+D24+D26-D56,0))","v":{"$error":"#REF!"}}]
[]
[null,"Tilsagnsbeløb i kr.",null,{"$f":"Budget!#REF!","v":{"$error":"#REF!"}}]

{"sheet":"Medarbejder 2","index":3,"n_rows":63,"n_cols":6,"rows_kept":63,"cut":false,"hidden":true,"merged":[[62,1,62,2],[60,1,60,2],[16,1,16,2],[33,1,33,2],[58,1,58,2],[46,1,46,2],[34,1,34,2],[22,1,22,2],[23,1,23,2],[24,1,24,2],[25,1,25,2],[27,1,27,2],[28,1,28,2],[29,1,29,2],[30,1,30,2],[31,1,31,2],[8,4,8,5],[21,1,21,2],[9,1,9,2],[9,4,9,5],[10,1,10,2],[11,1,11,3],[12,1,12,3],[14,1,14,3],[17,1,17,2],[18,1,18,2],[19,1,19,2],[20,1,20,2],[1,1,1,3],[3,1,3,3],[5,1,5,2],[6,1,6,2],[8,1,8,2],[7,1,7,2],[32,1,32,2],[48,1,48,2],[55,1,56,2],[55,3,56,3],[47,1,47,2],[35,1,35,2],[36,1,36,2],[37,1,37,2],[38,1,38,2],[39,1,39,2],[40,1,40,2],[41,1,41,2],[42,1,42,2],[43,1,43,2],[45,1,45,2]]}
[]
[null,"Slutregnskab for sporskiftepakken"]
[]
[null,"Oplysninger om medarbejderen"]
[]
[null,"Medarbejderens navn"]
[null,"Medarbejderens lønkompensation fra sporskifte (kr./t.)",null,{"$f":"IF(D8>261,(IF(D11=\"Ja\",260-'Format ark'!D13,260)),IF(D8<=260,IF(D11=\"Ja\",IF(D8<'Format ark'!D13,0,D8-'Format ark'!D13),D8)))","v":0}]
[null,"Medarbejderens timesats (kr./t.)"]
[null,"Medarbejderens højst gennemførte uddannelse",null,null,{"$f":"IF(D9=\"\",\"Husk at vælge medarbejderens højst gennemførte uddannelse.\",\" \")","v":"Husk at vælge medarbejderens højst gennemførte uddannelse."}]
[null,"Har medarbejderen brugt sin uddannelse de senest 5 år?",null,null,{"$f":"IF(D10=\"\",\"Husk at svare på spørgsmålet.\",\" \")","v":"Husk at svare på spørgsmålet."}]
[null,"Medarbejder formodes at være berettiget til at få VEU-godtgørelse ",null,{"$f":"IF(OR(D9=\"Videregående uddannelse\",D9=\"Gymnasial uddannelse\")*AND(D10=\"ja\"),\"Nej\",\"Ja\")","v":"Ja"}]
[null,"Beskriv herunder hvad formålet med den planlagte sporskiftepakke er for medarbejderen:"]
[]
[]
[null,"Aktiviteter"]
[]
[null,"Afklaring, vejledning mv. \nSkriv navn på kursus",null,"Medarbejderens timeforbug (timer)","Evt. deltagerbetaling (kr.)","Giver kurset ret til VEU-godtgørelse?"]
[]
[]
[]
[]
[]
[null,"Samlet antal timer (udregner selv)",null,{"$f":"SUM(D18:D22)","v":0}]
[null,"Samlet lønkompensation udover evt. VEU-godtgørelse (udregner selv)",null,{"$f":"IF(D11=\"Nej\",D23*D7,0)+IF(AND(D11=\"Ja\",F18=\"Ja\"),D18*D7,0)+IF(AND(D11=\"Ja\",F19=\"Ja\"),D19*D7,0)+IF(AND(D11=\"Ja\",F20=\"Ja\"),D20*D7,0)+IF(AND(D11=\"Ja\",F21=\"Ja\"),D21*D7,0)+IF(AND(D11=\"Ja\",F22=\"Ja\"),D22*D7,0)+IF(AND(D11=\"Ja\",F18=\"Nej\"),D18*IF(D8>261,(IF(F18=\"Ja\",260-'Format ark'!D13,260)),IF(D8<=260,IF(F18=\"Ja\",D8-'Format ark'!D13,D8))),0)+IF(AND(D11=\"Ja\",F19=\"Nej\"),D19*IF(D8>261,(IF(F19=\"Ja\",260-'Format ark'!D13,260)),IF(D8<=260,IF(F19=\"Ja\",D8-'Format ark'!D13,D8))),0)+IF(AND(D11=\"Ja\",F20=\"Nej\"),D20*IF(D8>261,(IF(F20=\"Ja\",260-'Format ark'!D13,260)),IF(D8<=260,IF(F20=\"Ja\",D8-'Format ark'!D13,D8))),0)+IF(AND(D11=\"Ja\",F21=\"Nej\"),D21*IF(D8>261,(IF(F21=\"Ja\",260-'Format ark'!D13,260)),IF(D8<=260,IF(F21=\"Ja\",D8-'Format ark'!D13,D8))),0)+IF(AND(D11=\"Ja\",F22=\"Nej\"),D22*IF(D8>261,(IF(F22=\"Ja\",260-'Format ark'!D13,260)),IF(D8<=260,IF(F22=\"Ja\",D8-'Format ark'!D13,D8))),0)","v":0}]
[null,"Estimeret VEU-godtgørelse",null,{"$f":"IF(AND(D11=\"Ja\",F18=\"Ja\"),D18*'Format ark'!D13,0)+IF(AND(D11=\"Ja\",F19=\"Ja\"),D19*'Format ark'!D13,0)+IF(AND(D11=\"Ja\",F20=\"Ja\"),D20*'Format ark'!D13,0)+IF(AND(D11=\"Ja\",F21=\"Ja\"),D21*'Format ark'!D13,0)+IF(AND(D11=\"Ja\",F22=\"Ja\"),D22*'Format ark'!D13,0)","v":0}]
[null,"Samlet deltagerbeltaing (udregner selv)",null,{"$f":"SUM(E18:E22)","v":0}]
[]
[null,"Erhversrettet efteruddannelse\nSkriv navn på efteruddannelse",null,"Medarbejderens timeforbrug (timer)","Evt. deltagerbetaling (kr.)","Giver kurset ret til VEU-godtgørelse?"]
[]
[]
[]
[]
[]
[]
[]
[]
[]
[]
[]
[]
[null,"Samlet antal timer (udregner selv)",null,{"$f":"SUM(D29:D40)","v":0}]
[null,"Samlet lønkompensation udover evt. VEU-godtgørelse (udregner selv)",null,{"$f":"IF(D11=\"Nej\",D41*D7,0)+IF(AND(D11=\"Ja\",F29=\"Ja\"),D29*D7,0)+IF(AND(D11=\"Ja\",F30=\"Ja\"),D30*D7,0)+IF(AND(D11=\"Ja\",F31=\"Ja\"),D31*D7,0)+IF(AND(D11=\"Ja\",F32=\"Ja\"),D32*D7,0)+IF(AND(D11=\"Ja\",F33=\"Ja\"),D33*D7,0)+IF(AND(D11=\"Ja\",F34=\"Ja\"),D34*D7,0)+IF(AND(D11=\"Ja\",F35=\"Ja\"),D35*D7,0)+IF(AND(D11=\"Ja\",F36=\"Ja\"),D36*D7,0)+IF(AND(D11=\"Ja\",F37=\"Ja\"),D37*D7,0)+IF(AND(D11=\"Ja\",F38=\"Ja\"),D38*D7,0)+IF(AND(D11=\"Ja\",F39=\"Ja\"),D39*D7,0)+IF(AND(D11=\"Ja\",F40=\"Ja\"),D40*D7,0)+IF(AND(D11=\"Ja\",F29=\"Nej\"),D29* IF(D8>261,(IF(F29=\"Ja\",260-'Format ark'!D13,260)),IF(D8<=260,IF(F29=\"Ja\",D8-'Format ark'!D13,D8))),0)+IF(AND(D11=\"Ja\",F30=\"Nej\"),D30* IF(D8>261,(IF(F30=\"Ja\",260-'Format ark'!D13,260)),IF(D8<=260,IF(F30=\"Ja\",D8-'Format ark'!D13,D8))),0)+IF(AND(D11=\"Ja\",F31=\"Nej\"),D31* IF(D8>261,(IF(F31=\"Ja\",260-'Format ark'!D13,260)),IF(D8<=260,IF(F31=\"Ja\",D8-'Format ark'!D13,D8))),0)+IF(AND(D11=\"Ja\",F32=\"Nej\"),D32* IF(D8>261,(IF(F32=\"Ja\",260-'Format ark'!D13,260)),IF(D8<=260,IF(F32=\"Ja\",D8-'Format ark'!D13,D8))),0)+IF(AND(D11=\"Ja\",F33=\"Nej\"),D33* IF(D8>261,(IF(F33=\"Ja\",260-'Format ark'!D13,260)),IF(D8<=260,IF(F33=\"Ja\",D8-'Format ark'!D13,D8))),0)+IF(AND(D11=\"Ja\",F34=\"Nej\"),D34* IF(D8>261,(IF(F34=\"Ja\",260-'Format ark'!D13,260)),IF(D8<=260,IF(F34=\"Ja\",D8-'Format ark'!D13,D8))),0)+IF(AND(D11=\"Ja\",F35=\"Nej\"),D35* IF(D8>261,(IF(F35=\"Ja\",260-'Format ark'!D13,260)),IF(D8<=260,IF(F35=\"Ja\",D8-'Format ark'!D13,D8))),0)+IF(AND(D11=\"Ja\",F36=\"Nej\"),D36* IF(D8>261,(IF(F36=\"Ja\",260-'Format ark'!D13,260)),IF(D8<=260,IF(F36=\"Ja\",D8-'Format ark'!D13,D8))),0)+IF(AND(D11=\"Ja\",F37=\"Nej\"),D37* IF(D8>261,(IF(F37=\"Ja\",260-'Format ark'!D13,260)),IF(D8<=260,IF(F37=\"Ja\",D8-'Format ark'!D13,D8))),0)+IF(AND(D11=\"Ja\",F38=\"Nej\"),D38* IF(D8>261,(IF(F38=\"Ja\",260-'Format ark'!D13,260)),IF(D8<=260,IF(F38=\"Ja\",D8-'Format ark'!D13,D8))),0)+IF(AND(D11=\"Ja\",F39=\"Nej\"),D39* IF(D8>261,(IF(F39=\"Ja\",260-'Format ark'!D13,260)),IF(D8<=260,IF(F39=\"Ja\",D8-'Format ark'!D13,D8))),0)+IF(AND(D11=\"Ja\",F40=\"Nej\"),D40* IF(D8>261,(IF(F40=\"Ja\",260-'Format ark'!D13,260)),IF(D8<=260,IF(F40=\"Ja\",D8-'Format ark'!D13,D8))),0)","v":0}]
[null,"Estimeret VEU-godtgørelse",null,{"$f":"IF(AND(D11=\"Ja\",F29=\"Ja\"),D29*'Format ark'!D13,0)+IF(AND(D11=\"Ja\",F30=\"Ja\"),D30*'Format ark'!D13,0)+IF(AND(D11=\"Ja\",F31=\"Ja\"),D31*'Format ark'!D13,0)+IF(AND(D11=\"Ja\",F32=\"Ja\"),D32*('Format ark'!D13),0)+IF(AND(D11=\"Ja\",F33=\"Ja\"),D33*'Format ark'!D13,0)+IF(AND(D11=\"Ja\",F34=\"Ja\"),D34*'Format ark'!D13,0)+IF(AND(D11=\"Ja\",F35=\"Ja\"),D35*'Format ark'!D13,0)+IF(AND(D11=\"Ja\",F36=\"Ja\"),D36*'Format ark'!D13,0)+IF(AND(D11=\"Ja\",F37=\"Ja\"),D37*'Format ark'!D13,0)+IF(AND(D11=\"Ja\",F38=\"Ja\"),D38*'Format ark'!D13,0)+IF(AND(D11=\"Ja\",F39=\"Ja\"),D39*'Format ark'!D13,0)+IF(AND(D11=\"Ja\",F40=\"Ja\"),D40*'Format ark'!D13,0)","v":0}]
[null,"Samlet deltagerbetaling (udregner selv)",null,{"$f":"SUM(E29:E40)","v":0}]
[]
[null,"Praktik"]
[null,"Navn på virksomhed og p-nummer"]
[null,"Medarbejderens timeforbrug",null,null,{"$f":"IF(D48>C51*0.5,\"Praktik må maksimalt udgøre 50% af det samlede tidsforbrug.\",\" \")","v":" "}]
[null,"Samlet lønkompensation for praktikopholdet",null,{"$f":"IF(D48>C51*0.5,\"IKKE MULIGT\",D48*(IF(D8>261,260,D8)))","v":0}]
[]
[null,"Samlet tidsforbrug ",{"$f":"IF(D48+D41+D23>300,\"IKKE MULIGT\",D48+D41+D23)","v":0},{"$f":"IF(C51>300,\"Det maksimale tidsforbrug er 300 timer\",\" \")","v":" "}]
[]
[null,"Tidsforbrug til administration","Antal timer","Beløb"]
[null,"Der kan godtgøres op til 5 timer.",null,{"$f":"IF(C54>5,\"Der kan maksimalt godtgøres 5 timer pr. medarbejder.\",C54*260)","v":0}]
[]
[null,"Samlet tilsagnsramme i kr. (maksimal støtte til sporskiftepakken): ",null,{"$f":"IF(AND(C51>300,D49+D44+D42+D26+D24+D54<D63+1),0,MIN(D49+D44+D42+D26+D24+D54,120000))","v":{"$error":"#REF!"}},{"$f":"IF(D56=120000,\"Det maksimale tilsagn pr. sporskiftepakke er nået, og det overstigende beløb er derfor selvbetaling.\",\"\")","v":{"$error":"#REF!"}}]
[]
[]
[null,"Estimeret VEU-godtgørelse",null,{"$f":"D43+D25","v":0}]
[]
[null,"Selvbetaling i kr. (udgifter udover den øvre tilsagnsramme)",null,{"$f":"IF(C51>300,0,MAX(D49+D54+D44+D42+D24+D26-D56,0))","v":{"$error":"#REF!"}}]
[]
[null,"Tilsagnsbeløb i kr.",null,{"$f":"Budget!#REF!","v":{"$error":"#REF!"}}]

{"sheet":"Medarbejder 3","index":4,"n_rows":63,"n_cols":6,"rows_kept":63,"cut":false,"hidden":true,"merged":[[62,1,62,2],[60,1,60,2],[16,1,16,2],[33,1,33,2],[58,1,58,2],[46,1,46,2],[34,1,34,2],[22,1,22,2],[23,1,23,2],[24,1,24,2],[25,1,25,2],[27,1,27,2],[28,1,28,2],[29,1,29,2],[30,1,30,2],[31,1,31,2],[8,4,8,5],[21,1,21,2],[9,1,9,2],[9,4,9,5],[10,1,10,2],[11,1,11,3],[12,1,12,3],[14,1,14,3],[17,1,17,2],[18,1,18,2],[19,1,19,2],[20,1,20,2],[1,1,1,3],[3,1,3,3],[5,1,5,2],[6,1,6,2],[8,1,8,2],[7,1,7,2],[32,1,32,2],[48,1,48,2],[55,1,56,2],[55,3,56,3],[47,1,47,2],[35,1,35,2],[36,1,36,2],[37,1,37,2],[38,1,38,2],[39,1,39,2],[40,1,40,2],[41,1,41,2],[42,1,42,2],[43,1,43,2],[45,1,45,2]]}
[]
[null,"Slutregnskab for sporskiftepakken"]
[]
[null,"Oplysninger om medarbejderen"]
[]
[null,"Medarbejderens navn"]
[null,"Medarbejderens lønkompensation fra sporskifte (kr./t.)",null,{"$f":"IF(D8>261,(IF(D11=\"Ja\",260-'Format ark'!D13,260)),IF(D8<=260,IF(D11=\"Ja\",IF(D8<'Format ark'!D13,0,D8-'Format ark'!D13),D8)))","v":0}]
[null,"Medarbejderens timesats (kr./t.)"]
[null,"Medarbejderens højst gennemførte uddannelse",null,null,{"$f":"IF(D9=\"\",\"Husk at vælge medarbejderens højst gennemførte uddannelse.\",\" \")","v":"Husk at vælge medarbejderens højst gennemførte uddannelse."}]
[null,"Har medarbejderen brugt sin uddannelse de senest 5 år?",null,null,{"$f":"IF(D10=\"\",\"Husk at svare på spørgsmålet.\",\" \")","v":"Husk at svare på spørgsmålet."}]
[null,"Medarbejder formodes at være berettiget til at få VEU-godtgørelse ",null,{"$f":"IF(OR(D9=\"Videregående uddannelse\",D9=\"Gymnasial uddannelse\")*AND(D10=\"ja\"),\"Nej\",\"Ja\")","v":"Ja"}]
[null,"Beskriv herunder hvad formålet med den planlagte sporskiftepakke er for medarbejderen:"]
[]
[]
[null,"Aktiviteter"]
[]
[null,"Afklaring, vejledning mv. \nSkriv navn på kursus",null,"Medarbejderens timeforbug (timer)","Evt. deltagerbetaling (kr.)","Giver kurset ret til VEU-godtgørelse?"]
[]
[]
[]
[]
[]
[null,"Samlet antal timer (udregner selv)",null,{"$f":"SUM(D18:D22)","v":0}]
[null,"Samlet lønkompensation udover evt. VEU-godtgørelse (udregner selv)",null,{"$f":"IF(D11=\"Nej\",D23*D7,0)+IF(AND(D11=\"Ja\",F18=\"Ja\"),D18*D7,0)+IF(AND(D11=\"Ja\",F19=\"Ja\"),D19*D7,0)+IF(AND(D11=\"Ja\",F20=\"Ja\"),D20*D7,0)+IF(AND(D11=\"Ja\",F21=\"Ja\"),D21*D7,0)+IF(AND(D11=\"Ja\",F22=\"Ja\"),D22*D7,0)+IF(AND(D11=\"Ja\",F18=\"Nej\"),D18*IF(D8>261,(IF(F18=\"Ja\",260-'Format ark'!D13,260)),IF(D8<=260,IF(F18=\"Ja\",D8-'Format ark'!D13,D8))),0)+IF(AND(D11=\"Ja\",F19=\"Nej\"),D19*IF(D8>261,(IF(F19=\"Ja\",260-'Format ark'!D13,260)),IF(D8<=260,IF(F19=\"Ja\",D8-'Format ark'!D13,D8))),0)+IF(AND(D11=\"Ja\",F20=\"Nej\"),D20*IF(D8>261,(IF(F20=\"Ja\",260-'Format ark'!D13,260)),IF(D8<=260,IF(F20=\"Ja\",D8-'Format ark'!D13,D8))),0)+IF(AND(D11=\"Ja\",F21=\"Nej\"),D21*IF(D8>261,(IF(F21=\"Ja\",260-'Format ark'!D13,260)),IF(D8<=260,IF(F21=\"Ja\",D8-'Format ark'!D13,D8))),0)+IF(AND(D11=\"Ja\",F22=\"Nej\"),D22*IF(D8>261,(IF(F22=\"Ja\",260-'Format ark'!D13,260)),IF(D8<=260,IF(F22=\"Ja\",D8-'Format ark'!D13,D8))),0)","v":0}]
[null,"Estimeret VEU-godtgørelse",null,{"$f":"IF(AND(D11=\"Ja\",F18=\"Ja\"),D18*'Format ark'!D13,0)+IF(AND(D11=\"Ja\",F19=\"Ja\"),D19*'Format ark'!D13,0)+IF(AND(D11=\"Ja\",F20=\"Ja\"),D20*'Format ark'!D13,0)+IF(AND(D11=\"Ja\",F21=\"Ja\"),D21*'Format ark'!D13,0)+IF(AND(D11=\"Ja\",F22=\"Ja\"),D22*'Format ark'!D13,0)","v":0}]
[null,"Samlet deltagerbeltaing (udregner selv)",null,{"$f":"SUM(E18:E22)","v":0}]
[]
[null,"Erhversrettet efteruddannelse\nSkriv navn på efteruddannelse",null,"Medarbejderens timeforbrug (timer)","Evt. deltagerbetaling (kr.)","Giver kurset ret til VEU-godtgørelse?"]
[]
[]
[]
[]
[]
[]
[]
[]
[]
[]
[]
[]
[null,"Samlet antal timer (udregner selv)",null,{"$f":"SUM(D29:D40)","v":0}]
[null,"Samlet lønkompensation udover evt. VEU-godtgørelse (udregner selv)",null,{"$f":"IF(D11=\"Nej\",D41*D7,0)+IF(AND(D11=\"Ja\",F29=\"Ja\"),D29*D7,0)+IF(AND(D11=\"Ja\",F30=\"Ja\"),D30*D7,0)+IF(AND(D11=\"Ja\",F31=\"Ja\"),D31*D7,0)+IF(AND(D11=\"Ja\",F32=\"Ja\"),D32*D7,0)+IF(AND(D11=\"Ja\",F33=\"Ja\"),D33*D7,0)+IF(AND(D11=\"Ja\",F34=\"Ja\"),D34*D7,0)+IF(AND(D11=\"Ja\",F35=\"Ja\"),D35*D7,0)+IF(AND(D11=\"Ja\",F36=\"Ja\"),D36*D7,0)+IF(AND(D11=\"Ja\",F37=\"Ja\"),D37*D7,0)+IF(AND(D11=\"Ja\",F38=\"Ja\"),D38*D7,0)+IF(AND(D11=\"Ja\",F39=\"Ja\"),D39*D7,0)+IF(AND(D11=\"Ja\",F40=\"Ja\"),D40*D7,0)+IF(AND(D11=\"Ja\",F29=\"Nej\"),D29* IF(D8>261,(IF(F29=\"Ja\",260-'Format ark'!D13,260)),IF(D8<=260,IF(F29=\"Ja\",D8-'Format ark'!D13,D8))),0)+IF(AND(D11=\"Ja\",F30=\"Nej\"),D30* IF(D8>261,(IF(F30=\"Ja\",260-'Format ark'!D13,260)),IF(D8<=260,IF(F30=\"Ja\",D8-'Format ark'!D13,D8))),0)+IF(AND(D11=\"Ja\",F31=\"Nej\"),D31* IF(D8>261,(IF(F31=\"Ja\",260-'Format ark'!D13,260)),IF(D8<=260,IF(F31=\"Ja\",D8-'Format ark'!D13,D8))),0)+IF(AND(D11=\"Ja\",F32=\"Nej\"),D32* IF(D8>261,(IF(F32=\"Ja\",260-'Format ark'!D13,260)),IF(D8<=260,IF(F32=\"Ja\",D8-'Format ark'!D13,D8))),0)+IF(AND(D11=\"Ja\",F33=\"Nej\"),D33* IF(D8>261,(IF(F33=\"Ja\",260-'Format ark'!D13,260)),IF(D8<=260,IF(F33=\"Ja\",D8-'Format ark'!D13,D8))),0)+IF(AND(D11=\"Ja\",F34=\"Nej\"),D34* IF(D8>261,(IF(F34=\"Ja\",260-'Format ark'!D13,260)),IF(D8<=260,IF(F34=\"Ja\",D8-'Format ark'!D13,D8))),0)+IF(AND(D11=\"Ja\",F35=\"Nej\"),D35* IF(D8>261,(IF(F35=\"Ja\",260-'Format ark'!D13,260)),IF(D8<=260,IF(F35=\"Ja\",D8-'Format ark'!D13,D8))),0)+IF(AND(D11=\"Ja\",F36=\"Nej\"),D36* IF(D8>261,(IF(F36=\"Ja\",260-'Format ark'!D13,260)),IF(D8<=260,IF(F36=\"Ja\",D8-'Format ark'!D13,D8))),0)+IF(AND(D11=\"Ja\",F37=\"Nej\"),D37* IF(D8>261,(IF(F37=\"Ja\",260-'Format ark'!D13,260)),IF(D8<=260,IF(F37=\"Ja\",D8-'Format ark'!D13,D8))),0)+IF(AND(D11=\"Ja\",F38=\"Nej\"),D38* IF(D8>261,(IF(F38=\"Ja\",260-'Format ark'!D13,260)),IF(D8<=260,IF(F38=\"Ja\",D8-'Format ark'!D13,D8))),0)+IF(AND(D11=\"Ja\",F39=\"Nej\"),D39* IF(D8>261,(IF(F39=\"Ja\",260-'Format ark'!D13,260)),IF(D8<=260,IF(F39=\"Ja\",D8-'Format ark'!D13,D8))),0)+IF(AND(D11=\"Ja\",F40=\"Nej\"),D40* IF(D8>261,(IF(F40=\"Ja\",260-'Format ark'!D13,260)),IF(D8<=260,IF(F40=\"Ja\",D8-'Format ark'!D13,D8))),0)","v":0}]
[null,"Estimeret VEU-godtgørelse",null,{"$f":"IF(AND(D11=\"Ja\",F29=\"Ja\"),D29*'Format ark'!D13,0)+IF(AND(D11=\"Ja\",F30=\"Ja\"),D30*'Format ark'!D13,0)+IF(AND(D11=\"Ja\",F31=\"Ja\"),D31*'Format ark'!D13,0)+IF(AND(D11=\"Ja\",F32=\"Ja\"),D32*('Format ark'!D13),0)+IF(AND(D11=\"Ja\",F33=\"Ja\"),D33*'Format ark'!D13,0)+IF(AND(D11=\"Ja\",F34=\"Ja\"),D34*'Format ark'!D13,0)+IF(AND(D11=\"Ja\",F35=\"Ja\"),D35*'Format ark'!D13,0)+IF(AND(D11=\"Ja\",F36=\"Ja\"),D36*'Format ark'!D13,0)+IF(AND(D11=\"Ja\",F37=\"Ja\"),D37*'Format ark'!D13,0)+IF(AND(D11=\"Ja\",F38=\"Ja\"),D38*'Format ark'!D13,0)+IF(AND(D11=\"Ja\",F39=\"Ja\"),D39*'Format ark'!D13,0)+IF(AND(D11=\"Ja\",F40=\"Ja\"),D40*'Format ark'!D13,0)","v":0}]
[null,"Samlet deltagerbetaling (udregner selv)",null,{"$f":"SUM(E29:E40)","v":0}]
[]
[null,"Praktik"]
[null,"Navn på virksomhed og p-nummer"]
[null,"Medarbejderens timeforbrug",null,null,{"$f":"IF(D48>C51*0.5,\"Praktik må maksimalt udgøre 50% af det samlede tidsforbrug.\",\" \")","v":" "}]
[null,"Samlet lønkompensation for praktikopholdet",null,{"$f":"IF(D48>C51*0.5,\"IKKE MULIGT\",D48*(IF(D8>261,260,D8)))","v":0}]
[]
[null,"Samlet tidsforbrug ",{"$f":"IF(D48+D41+D23>300,\"IKKE MULIGT\",D48+D41+D23)","v":0},{"$f":"IF(C51>300,\"Det maksimale tidsforbrug er 300 timer\",\" \")","v":" "}]
[]
[null,"Tidsforbrug til administration","Antal timer","Beløb"]
[null,"Der kan godtgøres op til 5 timer.",null,{"$f":"IF(C54>5,\"Der kan maksimalt godtgøres 5 timer pr. medarbejder.\",C54*260)","v":0}]
[]
[null,"Samlet tilsagnsramme i kr. (maksimal støtte til sporskiftepakken): ",null,{"$f":"IF(AND(C51>300,D49+D44+D42+D26+D24+D54<D63+1),0,MIN(D49+D44+D42+D26+D24+D54,120000))","v":{"$error":"#REF!"}},{"$f":"IF(D56=120000,\"Det maksimale tilsagn pr. sporskiftepakke er nået, og det overstigende beløb er derfor selvbetaling.\",\"\")","v":{"$error":"#REF!"}}]
[]
[]
[null,"Estimeret VEU-godtgørelse",null,{"$f":"D43+D25","v":0}]
[]
[null,"Selvbetaling i kr. (udgifter udover den øvre tilsagnsramme)",null,{"$f":"IF(C51>300,0,MAX(D49+D54+D44+D42+D24+D26-D56,0))","v":{"$error":"#REF!"}}]
[]
[null,"Tilsagnsbeløb i kr.",null,{"$f":"Slutregnskab!J10","v":{"$error":"#REF!"}}]

{"sheet":"Medarbejder 4","index":5,"n_rows":63,"n_cols":6,"rows_kept":63,"cut":false,"hidden":true,"merged":[[62,1,62,2],[60,1,60,2],[16,1,16,2],[33,1,33,2],[58,1,58,2],[46,1,46,2],[34,1,34,2],[22,1,22,2],[23,1,23,2],[24,1,24,2],[25,1,25,2],[27,1,27,2],[28,1,28,2],[29,1,29,2],[30,1,30,2],[31,1,31,2],[8,4,8,5],[21,1,21,2],[9,1,9,2],[9,4,9,5],[10,1,10,2],[11,1,11,3],[12,1,12,3],[14,1,14,3],[17,1,17,2],[18,1,18,2],[19,1,19,2],[20,1,20,2],[1,1,1,3],[3,1,3,3],[5,1,5,2],[6,1,6,2],[8,1,8,2],[7,1,7,2],[32,1,32,2],[48,1,48,2],[55,1,56,2],[55,3,56,3],[47,1,47,2],[35,1,35,2],[36,1,36,2],[37,1,37,2],[38,1,38,2],[39,1,39,2],[40,1,40,2],[41,1,41,2],[42,1,42,2],[43,1,43,2],[45,1,45,2]]}
[]
[null,"Slutregnskab for sporskiftepakken"]
[]
[null,"Oplysninger om medarbejderen"]
[]
[null,"Medarbejderens navn"]
[null,"Medarbejderens lønkompensation fra sporskifte (kr./t.)",null,{"$f":"IF(D8>261,(IF(D11=\"Ja\",260-'Format ark'!D13,260)),IF(D8<=260,IF(D11=\"Ja\",IF(D8<'Format ark'!D13,0,D8-'Format ark'!D13),D8)))","v":0}]
[null,"Medarbejderens timesats (kr./t.)"]
[null,"Medarbejderens højst gennemførte uddannelse",null,null,{"$f":"IF(D9=\"\",\"Husk at vælge medarbejderens højst gennemførte uddannelse.\",\" \")","v":"Husk at vælge medarbejderens højst gennemførte uddannelse."}]
[null,"Har medarbejderen brugt sin uddannelse de senest 5 år?",null,null,{"$f":"IF(D10=\"\",\"Husk at svare på spørgsmålet.\",\" \")","v":"Husk at svare på spørgsmålet."}]
[null,"Medarbejder formodes at være berettiget til at få VEU-godtgørelse ",null,{"$f":"IF(OR(D9=\"Videregående uddannelse\",D9=\"Gymnasial uddannelse\")*AND(D10=\"ja\"),\"Nej\",\"Ja\")","v":"Ja"}]
[null,"Beskriv herunder hvad formålet med den planlagte sporskiftepakke er for medarbejderen:"]
[]
[]
[null,"Aktiviteter"]
[]
[null,"Afklaring, vejledning mv. \nSkriv navn på kursus",null,"Medarbejderens timeforbug (timer)","Evt. deltagerbetaling (kr.)","Giver kurset ret til VEU-godtgørelse?"]
[]
[]
[]
[]
[]
[null,"Samlet antal timer (udregner selv)",null,{"$f":"SUM(D18:D22)","v":0}]
[null,"Samlet lønkompensation udover evt. VEU-godtgørelse (udregner selv)",null,{"$f":"IF(D11=\"Nej\",D23*D7,0)+IF(AND(D11=\"Ja\",F18=\"Ja\"),D18*D7,0)+IF(AND(D11=\"Ja\",F19=\"Ja\"),D19*D7,0)+IF(AND(D11=\"Ja\",F20=\"Ja\"),D20*D7,0)+IF(AND(D11=\"Ja\",F21=\"Ja\"),D21*D7,0)+IF(AND(D11=\"Ja\",F22=\"Ja\"),D22*D7,0)+IF(AND(D11=\"Ja\",F18=\"Nej\"),D18*IF(D8>261,(IF(F18=\"Ja\",260-'Format ark'!D13,260)),IF(D8<=260,IF(F18=\"Ja\",D8-'Format ark'!D13,D8))),0)+IF(AND(D11=\"Ja\",F19=\"Nej\"),D19*IF(D8>261,(IF(F19=\"Ja\",260-'Format ark'!D13,260)),IF(D8<=260,IF(F19=\"Ja\",D8-'Format ark'!D13,D8))),0)+IF(AND(D11=\"Ja\",F20=\"Nej\"),D20*IF(D8>261,(IF(F20=\"Ja\",260-'Format ark'!D13,260)),IF(D8<=260,IF(F20=\"Ja\",D8-'Format ark'!D13,D8))),0)+IF(AND(D11=\"Ja\",F21=\"Nej\"),D21*IF(D8>261,(IF(F21=\"Ja\",260-'Format ark'!D13,260)),IF(D8<=260,IF(F21=\"Ja\",D8-'Format ark'!D13,D8))),0)+IF(AND(D11=\"Ja\",F22=\"Nej\"),D22*IF(D8>261,(IF(F22=\"Ja\",260-'Format ark'!D13,260)),IF(D8<=260,IF(F22=\"Ja\",D8-'Format ark'!D13,D8))),0)","v":0}]
[null,"Estimeret VEU-godtgørelse",null,{"$f":"IF(AND(D11=\"Ja\",F18=\"Ja\"),D18*'Format ark'!D13,0)+IF(AND(D11=\"Ja\",F19=\"Ja\"),D19*'Format ark'!D13,0)+IF(AND(D11=\"Ja\",F20=\"Ja\"),D20*'Format ark'!D13,0)+IF(AND(D11=\"Ja\",F21=\"Ja\"),D21*'Format ark'!D13,0)+IF(AND(D11=\"Ja\",F22=\"Ja\"),D22*'Format ark'!D13,0)","v":0}]
[null,"Samlet deltagerbeltaing (udregner selv)",null,{"$f":"SUM(E18:E22)","v":0}]
[]
[null,"Erhversrettet efteruddannelse\nSkriv navn på efteruddannelse",null,"Medarbejderens timeforbrug (timer)","Evt. deltagerbetaling (kr.)","Giver kurset ret til VEU-godtgørelse?"]
[]
[]
[]
[]
[]
[]
[]
[]
[]
[]
[]
[]
[null,"Samlet antal timer (udregner selv)",null,{"$f":"SUM(D29:D40)","v":0}]
[null,"Samlet lønkompensation udover evt. VEU-godtgørelse (udregner selv)",null,{"$f":"IF(D11=\"Nej\",D41*D7,0)+IF(AND(D11=\"Ja\",F29=\"Ja\"),D29*D7,0)+IF(AND(D11=\"Ja\",F30=\"Ja\"),D30*D7,0)+IF(AND(D11=\"Ja\",F31=\"Ja\"),D31*D7,0)+IF(AND(D11=\"Ja\",F32=\"Ja\"),D32*D7,0)+IF(AND(D11=\"Ja\",F33=\"Ja\"),D33*D7,0)+IF(AND(D11=\"Ja\",F34=\"Ja\"),D34*D7,0)+IF(AND(D11=\"Ja\",F35=\"Ja\"),D35*D7,0)+IF(AND(D11=\"Ja\",F36=\"Ja\"),D36*D7,0)+IF(AND(D11=\"Ja\",F37=\"Ja\"),D37*D7,0)+IF(AND(D11=\"Ja\",F38=\"Ja\"),D38*D7,0)+IF(AND(D11=\"Ja\",F39=\"Ja\"),D39*D7,0)+IF(AND(D11=\"Ja\",F40=\"Ja\"),D40*D7,0)+IF(AND(D11=\"Ja\",F29=\"Nej\"),D29* IF(D8>261,(IF(F29=\"Ja\",260-'Format ark'!D13,260)),IF(D8<=260,IF(F29=\"Ja\",D8-'Format ark'!D13,D8))),0)+IF(AND(D11=\"Ja\",F30=\"Nej\"),D30* IF(D8>261,(IF(F30=\"Ja\",260-'Format ark'!D13,260)),IF(D8<=260,IF(F30=\"Ja\",D8-'Format ark'!D13,D8))),0)+IF(AND(D11=\"Ja\",F31=\"Nej\"),D31* IF(D8>261,(IF(F31=\"Ja\",260-'Format ark'!D13,260)),IF(D8<=260,IF(F31=\"Ja\",D8-'Format ark'!D13,D8))),0)+IF(AND(D11=\"Ja\",F32=\"Nej\"),D32* IF(D8>261,(IF(F32=\"Ja\",260-'Format ark'!D13,260)),IF(D8<=260,IF(F32=\"Ja\",D8-'Format ark'!D13,D8))),0)+IF(AND(D11=\"Ja\",F33=\"Nej\"),D33* IF(D8>261,(IF(F33=\"Ja\",260-'Format ark'!D13,260)),IF(D8<=260,IF(F33=\"Ja\",D8-'Format ark'!D13,D8))),0)+IF(AND(D11=\"Ja\",F34=\"Nej\"),D34* IF(D8>261,(IF(F34=\"Ja\",260-'Format ark'!D13,260)),IF(D8<=260,IF(F34=\"Ja\",D8-'Format ark'!D13,D8))),0)+IF(AND(D11=\"Ja\",F35=\"Nej\"),D35* IF(D8>261,(IF(F35=\"Ja\",260-'Format ark'!D13,260)),IF(D8<=260,IF(F35=\"Ja\",D8-'Format ark'!D13,D8))),0)+IF(AND(D11=\"Ja\",F36=\"Nej\"),D36* IF(D8>261,(IF(F36=\"Ja\",260-'Format ark'!D13,260)),IF(D8<=260,IF(F36=\"Ja\",D8-'Format ark'!D13,D8))),0)+IF(AND(D11=\"Ja\",F37=\"Nej\"),D37* IF(D8>261,(IF(F37=\"Ja\",260-'Format ark'!D13,260)),IF(D8<=260,IF(F37=\"Ja\",D8-'Format ark'!D13,D8))),0)+IF(AND(D11=\"Ja\",F38=\"Nej\"),D38* IF(D8>261,(IF(F38=\"Ja\",260-'Format ark'!D13,260)),IF(D8<=260,IF(F38=\"Ja\",D8-'Format ark'!D13,D8))),0)+IF(AND(D11=\"Ja\",F39=\"Nej\"),D39* IF(D8>261,(IF(F39=\"Ja\",260-'Format ark'!D13,260)),IF(D8<=260,IF(F39=\"Ja\",D8-'Format ark'!D13,D8))),0)+IF(AND(D11=\"Ja\",F40=\"Nej\"),D40* IF(D8>261,(IF(F40=\"Ja\",260-'Format ark'!D13,260)),IF(D8<=260,IF(F40=\"Ja\",D8-'Format ark'!D13,D8))),0)","v":0}]
[null,"Estimeret VEU-godtgørelse",null,{"$f":"IF(AND(D11=\"Ja\",F29=\"Ja\"),D29*'Format ark'!D13,0)+IF(AND(D11=\"Ja\",F30=\"Ja\"),D30*'Format ark'!D13,0)+IF(AND(D11=\"Ja\",F31=\"Ja\"),D31*'Format ark'!D13,0)+IF(AND(D11=\"Ja\",F32=\"Ja\"),D32*('Format ark'!D13),0)+IF(AND(D11=\"Ja\",F33=\"Ja\"),D33*'Format ark'!D13,0)+IF(AND(D11=\"Ja\",F34=\"Ja\"),D34*'Format ark'!D13,0)+IF(AND(D11=\"Ja\",F35=\"Ja\"),D35*'Format ark'!D13,0)+IF(AND(D11=\"Ja\",F36=\"Ja\"),D36*'Format ark'!D13,0)+IF(AND(D11=\"Ja\",F37=\"Ja\"),D37*'Format ark'!D13,0)+IF(AND(D11=\"Ja\",F38=\"Ja\"),D38*'Format ark'!D13,0)+IF(AND(D11=\"Ja\",F39=\"Ja\"),D39*'Format ark'!D13,0)+IF(AND(D11=\"Ja\",F40=\"Ja\"),D40*'Format ark'!D13,0)","v":0}]
[null,"Samlet deltagerbetaling (udregner selv)",null,{"$f":"SUM(E29:E40)","v":0}]
[]
[null,"Praktik"]
[null,"Navn på virksomhed og p-nummer"]
[null,"Medarbejderens timeforbrug",null,null,{"$f":"IF(D48>C51*0.5,\"Praktik må maksimalt udgøre 50% af det samlede tidsforbrug.\",\" \")","v":" "}]
[null,"Samlet lønkompensation for praktikopholdet",null,{"$f":"IF(D48>C51*0.5,\"IKKE MULIGT\",D48*(IF(D8>261,260,D8)))","v":0}]
[]
[null,"Samlet tidsforbrug ",{"$f":"IF(D48+D41+D23>300,\"IKKE MULIGT\",D48+D41+D23)","v":0},{"$f":"IF(C51>300,\"Det maksimale tidsforbrug er 300 timer\",\" \")","v":" "}]
[]
[null,"Tidsforbrug til administration","Antal timer","Beløb"]
[null,"Der kan godtgøres op til 5 timer.",null,{"$f":"IF(C54>5,\"Der kan maksimalt godtgøres 5 timer pr. medarbejder.\",C54*260)","v":0}]
[]
[null,"Samlet tilsagnsramme i kr. (maksimal støtte til sporskiftepakken): ",null,{"$f":"IF(AND(C51>300,D49+D44+D42+D26+D24+D54<D63+1),0,MIN(D49+D44+D42+D26+D24+D54,120000))","v":{"$error":"#REF!"}},{"$f":"IF(D56=120000,\"Det maksimale tilsagn pr. sporskiftepakke er nået, og det overstigende beløb er derfor selvbetaling.\",\"\")","v":{"$error":"#REF!"}}]
[]
[]
[null,"Estimeret VEU-godtgørelse",null,{"$f":"D43+D25","v":0}]
[]
[null,"Selvbetaling i kr. (udgifter udover den øvre tilsagnsramme)",null,{"$f":"IF(C51>300,0,MAX(D49+D54+D44+D42+D24+D26-D56,0))","v":{"$error":"#REF!"}}]
[]
[null,"Tilsagnsbeløb i kr.",null,{"$f":"Slutregnskab!J10","v":{"$error":"#REF!"}}]

{"sheet":"Medarbejder 5","index":6,"n_rows":63,"n_cols":6,"rows_kept":63,"cut":false,"hidden":true,"merged":[[62,1,62,2],[60,1,60,2],[16,1,16,2],[33,1,33,2],[58,1,58,2],[46,1,46,2],[34,1,34,2],[22,1,22,2],[23,1,23,2],[24,1,24,2],[25,1,25,2],[27,1,27,2],[28,1,28,2],[29,1,29,2],[30,1,30,2],[31,1,31,2],[8,4,8,5],[21,1,21,2],[9,1,9,2],[9,4,9,5],[10,1,10,2],[11,1,11,3],[12,1,12,3],[14,1,14,3],[17,1,17,2],[18,1,18,2],[19,1,19,2],[20,1,20,2],[1,1,1,3],[3,1,3,3],[5,1,5,2],[6,1,6,2],[8,1,8,2],[7,1,7,2],[32,1,32,2],[48,1,48,2],[55,1,56,2],[55,3,56,3],[47,1,47,2],[35,1,35,2],[36,1,36,2],[37,1,37,2],[38,1,38,2],[39,1,39,2],[40,1,40,2],[41,1,41,2],[42,1,42,2],[43,1,43,2],[45,1,45,2]]}
[]
[null,"Slutregnskab for sporskiftepakken"]
[]
[null,"Oplysninger om medarbejderen"]
[]
[null,"Medarbejderens navn"]
[null,"Medarbejderens lønkompensation fra sporskifte (kr./t.)",null,{"$f":"IF(D8>261,(IF(D11=\"Ja\",260-'Format ark'!D13,260)),IF(D8<=260,IF(D11=\"Ja\",IF(D8<'Format ark'!D13,0,D8-'Format ark'!D13),D8)))","v":0}]
[null,"Medarbejderens timesats (kr./t.)"]
[null,"Medarbejderens højst gennemførte uddannelse",null,null,{"$f":"IF(D9=\"\",\"Husk at vælge medarbejderens højst gennemførte uddannelse.\",\" \")","v":"Husk at vælge medarbejderens højst gennemførte uddannelse."}]
[null,"Har medarbejderen brugt sin uddannelse de senest 5 år?",null,null,{"$f":"IF(D10=\"\",\"Husk at svare på spørgsmålet.\",\" \")","v":"Husk at svare på spørgsmålet."}]
[null,"Medarbejder formodes at være berettiget til at få VEU-godtgørelse ",null,{"$f":"IF(OR(D9=\"Videregående uddannelse\",D9=\"Gymnasial uddannelse\")*AND(D10=\"ja\"),\"Nej\",\"Ja\")","v":"Ja"}]
[null,"Beskriv herunder hvad formålet med den planlagte sporskiftepakke er for medarbejderen:"]
[]
[]
[null,"Aktiviteter"]
[]
[null,"Afklaring, vejledning mv. \nSkriv navn på kursus",null,"Medarbejderens timeforbug (timer)","Evt. deltagerbetaling (kr.)","Giver kurset ret til VEU-godtgørelse?"]
[]
[]
[]
[]
[]
[null,"Samlet antal timer (udregner selv)",null,{"$f":"SUM(D18:D22)","v":0}]
[null,"Samlet lønkompensation udover evt. VEU-godtgørelse (udregner selv)",null,{"$f":"IF(D11=\"Nej\",D23*D7,0)+IF(AND(D11=\"Ja\",F18=\"Ja\"),D18*D7,0)+IF(AND(D11=\"Ja\",F19=\"Ja\"),D19*D7,0)+IF(AND(D11=\"Ja\",F20=\"Ja\"),D20*D7,0)+IF(AND(D11=\"Ja\",F21=\"Ja\"),D21*D7,0)+IF(AND(D11=\"Ja\",F22=\"Ja\"),D22*D7,0)+IF(AND(D11=\"Ja\",F18=\"Nej\"),D18*IF(D8>261,(IF(F18=\"Ja\",260-'Format ark'!D13,260)),IF(D8<=260,IF(F18=\"Ja\",D8-'Format ark'!D13,D8))),0)+IF(AND(D11=\"Ja\",F19=\"Nej\"),D19*IF(D8>261,(IF(F19=\"Ja\",260-'Format ark'!D13,260)),IF(D8<=260,IF(F19=\"Ja\",D8-'Format ark'!D13,D8))),0)+IF(AND(D11=\"Ja\",F20=\"Nej\"),D20*IF(D8>261,(IF(F20=\"Ja\",260-'Format ark'!D13,260)),IF(D8<=260,IF(F20=\"Ja\",D8-'Format ark'!D13,D8))),0)+IF(AND(D11=\"Ja\",F21=\"Nej\"),D21*IF(D8>261,(IF(F21=\"Ja\",260-'Format ark'!D13,260)),IF(D8<=260,IF(F21=\"Ja\",D8-'Format ark'!D13,D8))),0)+IF(AND(D11=\"Ja\",F22=\"Nej\"),D22*IF(D8>261,(IF(F22=\"Ja\",260-'Format ark'!D13,260)),IF(D8<=260,IF(F22=\"Ja\",D8-'Format ark'!D13,D8))),0)","v":0}]
[null,"Estimeret VEU-godtgørelse",null,{"$f":"IF(AND(D11=\"Ja\",F18=\"Ja\"),D18*'Format ark'!D13,0)+IF(AND(D11=\"Ja\",F19=\"Ja\"),D19*'Format ark'!D13,0)+IF(AND(D11=\"Ja\",F20=\"Ja\"),D20*'Format ark'!D13,0)+IF(AND(D11=\"Ja\",F21=\"Ja\"),D21*'Format ark'!D13,0)+IF(AND(D11=\"Ja\",F22=\"Ja\"),D22*'Format ark'!D13,0)","v":0}]
[null,"Samlet deltagerbeltaing (udregner selv)",null,{"$f":"SUM(E18:E22)","v":0}]
[]
[null,"Erhversrettet efteruddannelse\nSkriv navn på efteruddannelse",null,"Medarbejderens timeforbrug (timer)","Evt. deltagerbetaling (kr.)","Giver kurset ret til VEU-godtgørelse?"]
[]
[]
[]
[]
[]
[]
[]
[]
[]
[]
[]
[]
[null,"Samlet antal timer (udregner selv)",null,{"$f":"SUM(D29:D40)","v":0}]
[null,"Samlet lønkompensation udover evt. VEU-godtgørelse (udregner selv)",null,{"$f":"IF(D11=\"Nej\",D41*D7,0)+IF(AND(D11=\"Ja\",F29=\"Ja\"),D29*D7,0)+IF(AND(D11=\"Ja\",F30=\"Ja\"),D30*D7,0)+IF(AND(D11=\"Ja\",F31=\"Ja\"),D31*D7,0)+IF(AND(D11=\"Ja\",F32=\"Ja\"),D32*D7,0)+IF(AND(D11=\"Ja\",F33=\"Ja\"),D33*D7,0)+IF(AND(D11=\"Ja\",F34=\"Ja\"),D34*D7,0)+IF(AND(D11=\"Ja\",F35=\"Ja\"),D35*D7,0)+IF(AND(D11=\"Ja\",F36=\"Ja\"),D36*D7,0)+IF(AND(D11=\"Ja\",F37=\"Ja\"),D37*D7,0)+IF(AND(D11=\"Ja\",F38=\"Ja\"),D38*D7,0)+IF(AND(D11=\"Ja\",F39=\"Ja\"),D39*D7,0)+IF(AND(D11=\"Ja\",F40=\"Ja\"),D40*D7,0)+IF(AND(D11=\"Ja\",F29=\"Nej\"),D29* IF(D8>261,(IF(F29=\"Ja\",260-'Format ark'!D13,260)),IF(D8<=260,IF(F29=\"Ja\",D8-'Format ark'!D13,D8))),0)+IF(AND(D11=\"Ja\",F30=\"Nej\"),D30* IF(D8>261,(IF(F30=\"Ja\",260-'Format ark'!D13,260)),IF(D8<=260,IF(F30=\"Ja\",D8-'Format ark'!D13,D8))),0)+IF(AND(D11=\"Ja\",F31=\"Nej\"),D31* IF(D8>261,(IF(F31=\"Ja\",260-'Format ark'!D13,260)),IF(D8<=260,IF(F31=\"Ja\",D8-'Format ark'!D13,D8))),0)+IF(AND(D11=\"Ja\",F32=\"Nej\"),D32* IF(D8>261,(IF(F32=\"Ja\",260-'Format ark'!D13,260)),IF(D8<=260,IF(F32=\"Ja\",D8-'Format ark'!D13,D8))),0)+IF(AND(D11=\"Ja\",F33=\"Nej\"),D33* IF(D8>261,(IF(F33=\"Ja\",260-'Format ark'!D13,260)),IF(D8<=260,IF(F33=\"Ja\",D8-'Format ark'!D13,D8))),0)+IF(AND(D11=\"Ja\",F34=\"Nej\"),D34* IF(D8>261,(IF(F34=\"Ja\",260-'Format ark'!D13,260)),IF(D8<=260,IF(F34=\"Ja\",D8-'Format ark'!D13,D8))),0)+IF(AND(D11=\"Ja\",F35=\"Nej\"),D35* IF(D8>261,(IF(F35=\"Ja\",260-'Format ark'!D13,260)),IF(D8<=260,IF(F35=\"Ja\",D8-'Format ark'!D13,D8))),0)+IF(AND(D11=\"Ja\",F36=\"Nej\"),D36* IF(D8>261,(IF(F36=\"Ja\",260-'Format ark'!D13,260)),IF(D8<=260,IF(F36=\"Ja\",D8-'Format ark'!D13,D8))),0)+IF(AND(D11=\"Ja\",F37=\"Nej\"),D37* IF(D8>261,(IF(F37=\"Ja\",260-'Format ark'!D13,260)),IF(D8<=260,IF(F37=\"Ja\",D8-'Format ark'!D13,D8))),0)+IF(AND(D11=\"Ja\",F38=\"Nej\"),D38* IF(D8>261,(IF(F38=\"Ja\",260-'Format ark'!D13,260)),IF(D8<=260,IF(F38=\"Ja\",D8-'Format ark'!D13,D8))),0)+IF(AND(D11=\"Ja\",F39=\"Nej\"),D39* IF(D8>261,(IF(F39=\"Ja\",260-'Format ark'!D13,260)),IF(D8<=260,IF(F39=\"Ja\",D8-'Format ark'!D13,D8))),0)+IF(AND(D11=\"Ja\",F40=\"Nej\"),D40* IF(D8>261,(IF(F40=\"Ja\",260-'Format ark'!D13,260)),IF(D8<=260,IF(F40=\"Ja\",D8-'Format ark'!D13,D8))),0)","v":0}]
[null,"Estimeret VEU-godtgørelse",null,{"$f":"IF(AND(D11=\"Ja\",F29=\"Ja\"),D29*'Format ark'!D13,0)+IF(AND(D11=\"Ja\",F30=\"Ja\"),D30*'Format ark'!D13,0)+IF(AND(D11=\"Ja\",F31=\"Ja\"),D31*'Format ark'!D13,0)+IF(AND(D11=\"Ja\",F32=\"Ja\"),D32*('Format ark'!D13),0)+IF(AND(D11=\"Ja\",F33=\"Ja\"),D33*'Format ark'!D13,0)+IF(AND(D11=\"Ja\",F34=\"Ja\"),D34*'Format ark'!D13,0)+IF(AND(D11=\"Ja\",F35=\"Ja\"),D35*'Format ark'!D13,0)+IF(AND(D11=\"Ja\",F36=\"Ja\"),D36*'Format ark'!D13,0)+IF(AND(D11=\"Ja\",F37=\"Ja\"),D37*'Format ark'!D13,0)+IF(AND(D11=\"Ja\",F38=\"Ja\"),D38*'Format ark'!D13,0)+IF(AND(D11=\"Ja\",F39=\"Ja\"),D39*'Format ark'!D13,0)+IF(AND(D11=\"Ja\",F40=\"Ja\"),D40*'Format ark'!D13,0)","v":0}]
[null,"Samlet deltagerbetaling (udregner selv)",null,{"$f":"SUM(E29:E40)","v":0}]
[]
[null,"Praktik"]
[null,"Navn på virksomhed og p-nummer"]
[null,"Medarbejderens timeforbrug",null,null,{"$f":"IF(D48>C51*0.5,\"Praktik må maksimalt udgøre 50% af det samlede tidsforbrug.\",\" \")","v":" "}]
[null,"Samlet lønkompensation for praktikopholdet",null,{"$f":"IF(D48>C51*0.5,\"IKKE MULIGT\",D48*(IF(D8>261,260,D8)))","v":0}]
[]
[null,"Samlet tidsforbrug ",{"$f":"IF(D48+D41+D23>300,\"IKKE MULIGT\",D48+D41+D23)","v":0},{"$f":"IF(C51>300,\"Det maksimale tidsforbrug er 300 timer\",\" \")","v":" "}]
[]
[null,"Tidsforbrug til administration","Antal timer","Beløb"]
[null,"Der kan godtgøres op til 5 timer.",null,{"$f":"IF(C54>5,\"Der kan maksimalt godtgøres 5 timer pr. medarbejder.\",C54*260)","v":0}]
[]
[null,"Samlet tilsagnsramme i kr. (maksimal støtte til sporskiftepakken): ",null,{"$f":"IF(AND(C51>300,D49+D44+D42+D26+D24+D54<D63+1),0,MIN(D49+D44+D42+D26+D24+D54,120000))","v":{"$error":"#REF!"}},{"$f":"IF(D56=120000,\"Det maksimale tilsagn pr. sporskiftepakke er nået, og det overstigende beløb er derfor selvbetaling.\",\"\")","v":{"$error":"#REF!"}}]
[]
[]
[null,"Estimeret VEU-godtgørelse",null,{"$f":"D43+D25","v":0}]
[]
[null,"Selvbetaling i kr. (udgifter udover den øvre tilsagnsramme)",null,{"$f":"IF(C51>300,0,MAX(D49+D54+D44+D42+D24+D26-D56,0))","v":{"$error":"#REF!"}}]
[]
[null,"Tilsagnsbeløb i kr.",null,{"$f":"Slutregnskab!J10","v":{"$error":"#REF!"}}]

{"sheet":"Medarbejder 6","index":7,"n_rows":63,"n_cols":6,"rows_kept":63,"cut":false,"hidden":true,"merged":[[62,1,62,2],[60,1,60,2],[16,1,16,2],[33,1,33,2],[58,1,58,2],[46,1,46,2],[34,1,34,2],[22,1,22,2],[23,1,23,2],[24,1,24,2],[25,1,25,2],[27,1,27,2],[28,1,28,2],[29,1,29,2],[30,1,30,2],[31,1,31,2],[8,4,8,5],[21,1,21,2],[9,1,9,2],[9,4,9,5],[10,1,10,2],[11,1,11,3],[12,1,12,3],[14,1,14,3],[17,1,17,2],[18,1,18,2],[19,1,19,2],[20,1,20,2],[1,1,1,3],[3,1,3,3],[5,1,5,2],[6,1,6,2],[8,1,8,2],[7,1,7,2],[32,1,32,2],[48,1,48,2],[55,1,56,2],[55,3,56,3],[47,1,47,2],[35,1,35,2],[36,1,36,2],[37,1,37,2],[38,1,38,2],[39,1,39,2],[40,1,40,2],[41,1,41,2],[42,1,42,2],[43,1,43,2],[45,1,45,2]]}
[]
[null,"Slutregnskab for sporskiftepakken"]
[]
[null,"Oplysninger om medarbejderen"]
[]
[null,"Medarbejderens navn"]
[null,"Medarbejderens lønkompensation fra sporskifte (kr./t.)",null,{"$f":"IF(D8>261,(IF(D11=\"Ja\",260-'Format ark'!D13,260)),IF(D8<=260,IF(D11=\"Ja\",IF(D8<'Format ark'!D13,0,D8-'Format ark'!D13),D8)))","v":0}]
[null,"Medarbejderens timesats (kr./t.)"]
[null,"Medarbejderens højst gennemførte uddannelse",null,null,{"$f":"IF(D9=\"\",\"Husk at vælge medarbejderens højst gennemførte uddannelse.\",\" \")","v":"Husk at vælge medarbejderens højst gennemførte uddannelse."}]
[null,"Har medarbejderen brugt sin uddannelse de senest 5 år?",null,null,{"$f":"IF(D10=\"\",\"Husk at svare på spørgsmålet.\",\" \")","v":"Husk at svare på spørgsmålet."}]
[null,"Medarbejder formodes at være berettiget til at få VEU-godtgørelse ",null,{"$f":"IF(OR(D9=\"Videregående uddannelse\",D9=\"Gymnasial uddannelse\")*AND(D10=\"ja\"),\"Nej\",\"Ja\")","v":"Ja"}]
[null,"Beskriv herunder hvad formålet med den planlagte sporskiftepakke er for medarbejderen:"]
[]
[]
[null,"Aktiviteter"]
[]
[null,"Afklaring, vejledning mv. \nSkriv navn på kursus",null,"Medarbejderens timeforbug (timer)","Evt. deltagerbetaling (kr.)","Giver kurset ret til VEU-godtgørelse?"]
[]
[]
[]
[]
[]
[null,"Samlet antal timer (udregner selv)",null,{"$f":"SUM(D18:D22)","v":0}]
[null,"Samlet lønkompensation udover evt. VEU-godtgørelse (udregner selv)",null,{"$f":"IF(D11=\"Nej\",D23*D7,0)+IF(AND(D11=\"Ja\",F18=\"Ja\"),D18*D7,0)+IF(AND(D11=\"Ja\",F19=\"Ja\"),D19*D7,0)+IF(AND(D11=\"Ja\",F20=\"Ja\"),D20*D7,0)+IF(AND(D11=\"Ja\",F21=\"Ja\"),D21*D7,0)+IF(AND(D11=\"Ja\",F22=\"Ja\"),D22*D7,0)+IF(AND(D11=\"Ja\",F18=\"Nej\"),D18*IF(D8>261,(IF(F18=\"Ja\",260-'Format ark'!D13,260)),IF(D8<=260,IF(F18=\"Ja\",D8-'Format ark'!D13,D8))),0)+IF(AND(D11=\"Ja\",F19=\"Nej\"),D19*IF(D8>261,(IF(F19=\"Ja\",260-'Format ark'!D13,260)),IF(D8<=260,IF(F19=\"Ja\",D8-'Format ark'!D13,D8))),0)+IF(AND(D11=\"Ja\",F20=\"Nej\"),D20*IF(D8>261,(IF(F20=\"Ja\",260-'Format ark'!D13,260)),IF(D8<=260,IF(F20=\"Ja\",D8-'Format ark'!D13,D8))),0)+IF(AND(D11=\"Ja\",F21=\"Nej\"),D21*IF(D8>261,(IF(F21=\"Ja\",260-'Format ark'!D13,260)),IF(D8<=260,IF(F21=\"Ja\",D8-'Format ark'!D13,D8))),0)+IF(AND(D11=\"Ja\",F22=\"Nej\"),D22*IF(D8>261,(IF(F22=\"Ja\",260-'Format ark'!D13,260)),IF(D8<=260,IF(F22=\"Ja\",D8-'Format ark'!D13,D8))),0)","v":0}]
[null,"Estimeret VEU-godtgørelse",null,{"$f":"IF(AND(D11=\"Ja\",F18=\"Ja\"),D18*'Format ark'!D13,0)+IF(AND(D11=\"Ja\",F19=\"Ja\"),D19*'Format ark'!D13,0)+IF(AND(D11=\"Ja\",F20=\"Ja\"),D20*'Format ark'!D13,0)+IF(AND(D11=\"Ja\",F21=\"Ja\"),D21*'Format ark'!D13,0)+IF(AND(D11=\"Ja\",F22=\"Ja\"),D22*'Format ark'!D13,0)","v":0}]
[null,"Samlet deltagerbeltaing (udregner selv)",null,{"$f":"SUM(E18:E22)","v":0}]
[]
[null,"Erhversrettet efteruddannelse\nSkriv navn på efteruddannelse",null,"Medarbejderens timeforbrug (timer)","Evt. deltagerbetaling (kr.)","Giver kurset ret til VEU-godtgørelse?"]
[]
[]
[]
[]
[]
[]
[]
[]
[]
[]
[]
[]
[null,"Samlet antal timer (udregner selv)",null,{"$f":"SUM(D29:D40)","v":0}]
[null,"Samlet lønkompensation udover evt. VEU-godtgørelse (udregner selv)",null,{"$f":"IF(D11=\"Nej\",D41*D7,0)+IF(AND(D11=\"Ja\",F29=\"Ja\"),D29*D7,0)+IF(AND(D11=\"Ja\",F30=\"Ja\"),D30*D7,0)+IF(AND(D11=\"Ja\",F31=\"Ja\"),D31*D7,0)+IF(AND(D11=\"Ja\",F32=\"Ja\"),D32*D7,0)+IF(AND(D11=\"Ja\",F33=\"Ja\"),D33*D7,0)+IF(AND(D11=\"Ja\",F34=\"Ja\"),D34*D7,0)+IF(AND(D11=\"Ja\",F35=\"Ja\"),D35*D7,0)+IF(AND(D11=\"Ja\",F36=\"Ja\"),D36*D7,0)+IF(AND(D11=\"Ja\",F37=\"Ja\"),D37*D7,0)+IF(AND(D11=\"Ja\",F38=\"Ja\"),D38*D7,0)+IF(AND(D11=\"Ja\",F39=\"Ja\"),D39*D7,0)+IF(AND(D11=\"Ja\",F40=\"Ja\"),D40*D7,0)+IF(AND(D11=\"Ja\",F29=\"Nej\"),D29* IF(D8>261,(IF(F29=\"Ja\",260-'Format ark'!D13,260)),IF(D8<=260,IF(F29=\"Ja\",D8-'Format ark'!D13,D8))),0)+IF(AND(D11=\"Ja\",F30=\"Nej\"),D30* IF(D8>261,(IF(F30=\"Ja\",260-'Format ark'!D13,260)),IF(D8<=260,IF(F30=\"Ja\",D8-'Format ark'!D13,D8))),0)+IF(AND(D11=\"Ja\",F31=\"Nej\"),D31* IF(D8>261,(IF(F31=\"Ja\",260-'Format ark'!D13,260)),IF(D8<=260,IF(F31=\"Ja\",D8-'Format ark'!D13,D8))),0)+IF(AND(D11=\"Ja\",F32=\"Nej\"),D32* IF(D8>261,(IF(F32=\"Ja\",260-'Format ark'!D13,260)),IF(D8<=260,IF(F32=\"Ja\",D8-'Format ark'!D13,D8))),0)+IF(AND(D11=\"Ja\",F33=\"Nej\"),D33* IF(D8>261,(IF(F33=\"Ja\",260-'Format ark'!D13,260)),IF(D8<=260,IF(F33=\"Ja\",D8-'Format ark'!D13,D8))),0)+IF(AND(D11=\"Ja\",F34=\"Nej\"),D34* IF(D8>261,(IF(F34=\"Ja\",260-'Format ark'!D13,260)),IF(D8<=260,IF(F34=\"Ja\",D8-'Format ark'!D13,D8))),0)+IF(AND(D11=\"Ja\",F35=\"Nej\"),D35* IF(D8>261,(IF(F35=\"Ja\",260-'Format ark'!D13,260)),IF(D8<=260,IF(F35=\"Ja\",D8-'Format ark'!D13,D8))),0)+IF(AND(D11=\"Ja\",F36=\"Nej\"),D36* IF(D8>261,(IF(F36=\"Ja\",260-'Format ark'!D13,260)),IF(D8<=260,IF(F36=\"Ja\",D8-'Format ark'!D13,D8))),0)+IF(AND(D11=\"Ja\",F37=\"Nej\"),D37* IF(D8>261,(IF(F37=\"Ja\",260-'Format ark'!D13,260)),IF(D8<=260,IF(F37=\"Ja\",D8-'Format ark'!D13,D8))),0)+IF(AND(D11=\"Ja\",F38=\"Nej\"),D38* IF(D8>261,(IF(F38=\"Ja\",260-'Format ark'!D13,260)),IF(D8<=260,IF(F38=\"Ja\",D8-'Format ark'!D13,D8))),0)+IF(AND(D11=\"Ja\",F39=\"Nej\"),D39* IF(D8>261,(IF(F39=\"Ja\",260-'Format ark'!D13,260)),IF(D8<=260,IF(F39=\"Ja\",D8-'Format ark'!D13,D8))),0)+IF(AND(D11=\"Ja\",F40=\"Nej\"),D40* IF(D8>261,(IF(F40=\"Ja\",260-'Format ark'!D13,260)),IF(D8<=260,IF(F40=\"Ja\",D8-'Format ark'!D13,D8))),0)","v":0}]
[null,"Estimeret VEU-godtgørelse",null,{"$f":"IF(AND(D11=\"Ja\",F29=\"Ja\"),D29*'Format ark'!D13,0)+IF(AND(D11=\"Ja\",F30=\"Ja\"),D30*'Format ark'!D13,0)+IF(AND(D11=\"Ja\",F31=\"Ja\"),D31*'Format ark'!D13,0)+IF(AND(D11=\"Ja\",F32=\"Ja\"),D32*('Format ark'!D13),0)+IF(AND(D11=\"Ja\",F33=\"Ja\"),D33*'Format ark'!D13,0)+IF(AND(D11=\"Ja\",F34=\"Ja\"),D34*'Format ark'!D13,0)+IF(AND(D11=\"Ja\",F35=\"Ja\"),D35*'Format ark'!D13,0)+IF(AND(D11=\"Ja\",F36=\"Ja\"),D36*'Format ark'!D13,0)+IF(AND(D11=\"Ja\",F37=\"Ja\"),D37*'Format ark'!D13,0)+IF(AND(D11=\"Ja\",F38=\"Ja\"),D38*'Format ark'!D13,0)+IF(AND(D11=\"Ja\",F39=\"Ja\"),D39*'Format ark'!D13,0)+IF(AND(D11=\"Ja\",F40=\"Ja\"),D40*'Format ark'!D13,0)","v":0}]
[null,"Samlet deltagerbetaling (udregner selv)",null,{"$f":"SUM(E29:E40)","v":0}]
[]
[null,"Praktik"]
[null,"Navn på virksomhed og p-nummer"]
[null,"Medarbejderens timeforbrug",null,null,{"$f":"IF(D48>C51*0.5,\"Praktik må maksimalt udgøre 50% af det samlede tidsforbrug.\",\" \")","v":" "}]
[null,"Samlet lønkompensation for praktikopholdet",null,{"$f":"IF(D48>C51*0.5,\"IKKE MULIGT\",D48*(IF(D8>261,260,D8)))","v":0}]
[]
[null,"Samlet tidsforbrug ",{"$f":"IF(D48+D41+D23>300,\"IKKE MULIGT\",D48+D41+D23)","v":0},{"$f":"IF(C51>300,\"Det maksimale tidsforbrug er 300 timer\",\" \")","v":" "}]
[]
[null,"Tidsforbrug til administration","Antal timer","Beløb"]
[null,"Der kan godtgøres op til 5 timer.",null,{"$f":"IF(C54>5,\"Der kan maksimalt godtgøres 5 timer pr. medarbejder.\",C54*260)","v":0}]
[]
[null,"Samlet tilsagnsramme i kr. (maksimal støtte til sporskiftepakken): ",null,{"$f":"IF(AND(C51>300,D49+D44+D42+D26+D24+D54<D63+1),0,MIN(D49+D44+D42+D26+D24+D54,120000))","v":{"$error":"#REF!"}},{"$f":"IF(D56=120000,\"Det maksimale tilsagn pr. sporskiftepakke er nået, og det overstigende beløb er derfor selvbetaling.\",\"\")","v":{"$error":"#REF!"}}]
[]
[]
[null,"Estimeret VEU-godtgørelse",null,{"$f":"D43+D25","v":0}]
[]
[null,"Selvbetaling i kr. (udgifter udover den øvre tilsagnsramme)",null,{"$f":"IF(C51>300,0,MAX(D49+D54+D44+D42+D24+D26-D56,0))","v":{"$error":"#REF!"}}]
[]
[null,"Tilsagnsbeløb i kr.",null,{"$f":"Slutregnskab!J10","v":{"$error":"#REF!"}}]

{"sheet":"Medarbejder 7","index":8,"n_rows":63,"n_cols":6,"rows_kept":63,"cut":false,"hidden":true,"merged":[[62,1,62,2],[60,1,60,2],[16,1,16,2],[33,1,33,2],[58,1,58,2],[46,1,46,2],[34,1,34,2],[22,1,22,2],[23,1,23,2],[24,1,24,2],[25,1,25,2],[27,1,27,2],[28,1,28,2],[29,1,29,2],[30,1,30,2],[31,1,31,2],[8,4,8,5],[21,1,21,2],[9,1,9,2],[9,4,9,5],[10,1,10,2],[11,1,11,3],[12,1,12,3],[14,1,14,3],[17,1,17,2],[18,1,18,2],[19,1,19,2],[20,1,20,2],[1,1,1,3],[3,1,3,3],[5,1,5,2],[6,1,6,2],[8,1,8,2],[7,1,7,2],[32,1,32,2],[48,1,48,2],[55,1,56,2],[55,3,56,3],[47,1,47,2],[35,1,35,2],[36,1,36,2],[37,1,37,2],[38,1,38,2],[39,1,39,2],[40,1,40,2],[41,1,41,2],[42,1,42,2],[43,1,43,2],[45,1,45,2]]}
[]
[null,"Slutregnskab for sporskiftepakken"]
[]
[null,"Oplysninger om medarbejderen"]
[]
[null,"Medarbejderens navn"]
[null,"Medarbejderens lønkompensation fra sporskifte (kr./t.)",null,{"$f":"IF(D8>261,(IF(D11=\"Ja\",260-'Format ark'!D13,260)),IF(D8<=260,IF(D11=\"Ja\",IF(D8<'Format ark'!D13,0,D8-'Format ark'!D13),D8)))","v":0}]
[null,"Medarbejderens timesats (kr./t.)"]
[null,"Medarbejderens højst gennemførte uddannelse",null,null,{"$f":"IF(D9=\"\",\"Husk at vælge medarbejderens højst gennemførte uddannelse.\",\" \")","v":"Husk at vælge medarbejderens højst gennemførte uddannelse."}]
[null,"Har medarbejderen brugt sin uddannelse de senest 5 år?",null,null,{"$f":"IF(D10=\"\",\"Husk at svare på spørgsmålet.\",\" \")","v":"Husk at svare på spørgsmålet."}]
[null,"Medarbejder formodes at være berettiget til at få VEU-godtgørelse ",null,{"$f":"IF(OR(D9=\"Videregående uddannelse\",D9=\"Gymnasial uddannelse\")*AND(D10=\"ja\"),\"Nej\",\"Ja\")","v":"Ja"}]
[null,"Beskriv herunder hvad formålet med den planlagte sporskiftepakke er for medarbejderen:"]
[]
[]
[null,"Aktiviteter"]
[]
[null,"Afklaring, vejledning mv. \nSkriv navn på kursus",null,"Medarbejderens timeforbug (timer)","Evt. deltagerbetaling (kr.)","Giver kurset ret til VEU-godtgørelse?"]
[]
[]
[]
[]
[]
[null,"Samlet antal timer (udregner selv)",null,{"$f":"SUM(D18:D22)","v":0}]
[null,"Samlet lønkompensation udover evt. VEU-godtgørelse (udregner selv)",null,{"$f":"IF(D11=\"Nej\",D23*D7,0)+IF(AND(D11=\"Ja\",F18=\"Ja\"),D18*D7,0)+IF(AND(D11=\"Ja\",F19=\"Ja\"),D19*D7,0)+IF(AND(D11=\"Ja\",F20=\"Ja\"),D20*D7,0)+IF(AND(D11=\"Ja\",F21=\"Ja\"),D21*D7,0)+IF(AND(D11=\"Ja\",F22=\"Ja\"),D22*D7,0)+IF(AND(D11=\"Ja\",F18=\"Nej\"),D18*IF(D8>261,(IF(F18=\"Ja\",260-'Format ark'!D13,260)),IF(D8<=260,IF(F18=\"Ja\",D8-'Format ark'!D13,D8))),0)+IF(AND(D11=\"Ja\",F19=\"Nej\"),D19*IF(D8>261,(IF(F19=\"Ja\",260-'Format ark'!D13,260)),IF(D8<=260,IF(F19=\"Ja\",D8-'Format ark'!D13,D8))),0)+IF(AND(D11=\"Ja\",F20=\"Nej\"),D20*IF(D8>261,(IF(F20=\"Ja\",260-'Format ark'!D13,260)),IF(D8<=260,IF(F20=\"Ja\",D8-'Format ark'!D13,D8))),0)+IF(AND(D11=\"Ja\",F21=\"Nej\"),D21*IF(D8>261,(IF(F21=\"Ja\",260-'Format ark'!D13,260)),IF(D8<=260,IF(F21=\"Ja\",D8-'Format ark'!D13,D8))),0)+IF(AND(D11=\"Ja\",F22=\"Nej\"),D22*IF(D8>261,(IF(F22=\"Ja\",260-'Format ark'!D13,260)),IF(D8<=260,IF(F22=\"Ja\",D8-'Format ark'!D13,D8))),0)","v":0}]
[null,"Estimeret VEU-godtgørelse",null,{"$f":"IF(AND(D11=\"Ja\",F18=\"Ja\"),D18*'Format ark'!D13,0)+IF(AND(D11=\"Ja\",F19=\"Ja\"),D19*'Format ark'!D13,0)+IF(AND(D11=\"Ja\",F20=\"Ja\"),D20*'Format ark'!D13,0)+IF(AND(D11=\"Ja\",F21=\"Ja\"),D21*'Format ark'!D13,0)+IF(AND(D11=\"Ja\",F22=\"Ja\"),D22*'Format ark'!D13,0)","v":0}]
[null,"Samlet deltagerbeltaing (udregner selv)",null,{"$f":"SUM(E18:E22)","v":0}]
[]
[null,"Erhversrettet efteruddannelse\nSkriv navn på efteruddannelse",null,"Medarbejderens timeforbrug (timer)","Evt. deltagerbetaling (kr.)","Giver kurset ret til VEU-godtgørelse?"]
[]
[]
[]
[]
[]
[]
[]
[]
[]
[]
[]
[]
[null,"Samlet antal timer (udregner selv)",null,{"$f":"SUM(D29:D40)","v":0}]
[null,"Samlet lønkompensation udover evt. VEU-godtgørelse (udregner selv)",null,{"$f":"IF(D11=\"Nej\",D41*D7,0)+IF(AND(D11=\"Ja\",F29=\"Ja\"),D29*D7,0)+IF(AND(D11=\"Ja\",F30=\"Ja\"),D30*D7,0)+IF(AND(D11=\"Ja\",F31=\"Ja\"),D31*D7,0)+IF(AND(D11=\"Ja\",F32=\"Ja\"),D32*D7,0)+IF(AND(D11=\"Ja\",F33=\"Ja\"),D33*D7,0)+IF(AND(D11=\"Ja\",F34=\"Ja\"),D34*D7,0)+IF(AND(D11=\"Ja\",F35=\"Ja\"),D35*D7,0)+IF(AND(D11=\"Ja\",F36=\"Ja\"),D36*D7,0)+IF(AND(D11=\"Ja\",F37=\"Ja\"),D37*D7,0)+IF(AND(D11=\"Ja\",F38=\"Ja\"),D38*D7,0)+IF(AND(D11=\"Ja\",F39=\"Ja\"),D39*D7,0)+IF(AND(D11=\"Ja\",F40=\"Ja\"),D40*D7,0)+IF(AND(D11=\"Ja\",F29=\"Nej\"),D29* IF(D8>261,(IF(F29=\"Ja\",260-'Format ark'!D13,260)),IF(D8<=260,IF(F29=\"Ja\",D8-'Format ark'!D13,D8))),0)+IF(AND(D11=\"Ja\",F30=\"Nej\"),D30* IF(D8>261,(IF(F30=\"Ja\",260-'Format ark'!D13,260)),IF(D8<=260,IF(F30=\"Ja\",D8-'Format ark'!D13,D8))),0)+IF(AND(D11=\"Ja\",F31=\"Nej\"),D31* IF(D8>261,(IF(F31=\"Ja\",260-'Format ark'!D13,260)),IF(D8<=260,IF(F31=\"Ja\",D8-'Format ark'!D13,D8))),0)+IF(AND(D11=\"Ja\",F32=\"Nej\"),D32* IF(D8>261,(IF(F32=\"Ja\",260-'Format ark'!D13,260)),IF(D8<=260,IF(F32=\"Ja\",D8-'Format ark'!D13,D8))),0)+IF(AND(D11=\"Ja\",F33=\"Nej\"),D33* IF(D8>261,(IF(F33=\"Ja\",260-'Format ark'!D13,260)),IF(D8<=260,IF(F33=\"Ja\",D8-'Format ark'!D13,D8))),0)+IF(AND(D11=\"Ja\",F34=\"Nej\"),D34* IF(D8>261,(IF(F34=\"Ja\",260-'Format ark'!D13,260)),IF(D8<=260,IF(F34=\"Ja\",D8-'Format ark'!D13,D8))),0)+IF(AND(D11=\"Ja\",F35=\"Nej\"),D35* IF(D8>261,(IF(F35=\"Ja\",260-'Format ark'!D13,260)),IF(D8<=260,IF(F35=\"Ja\",D8-'Format ark'!D13,D8))),0)+IF(AND(D11=\"Ja\",F36=\"Nej\"),D36* IF(D8>261,(IF(F36=\"Ja\",260-'Format ark'!D13,260)),IF(D8<=260,IF(F36=\"Ja\",D8-'Format ark'!D13,D8))),0)+IF(AND(D11=\"Ja\",F37=\"Nej\"),D37* IF(D8>261,(IF(F37=\"Ja\",260-'Format ark'!D13,260)),IF(D8<=260,IF(F37=\"Ja\",D8-'Format ark'!D13,D8))),0)+IF(AND(D11=\"Ja\",F38=\"Nej\"),D38* IF(D8>261,(IF(F38=\"Ja\",260-'Format ark'!D13,260)),IF(D8<=260,IF(F38=\"Ja\",D8-'Format ark'!D13,D8))),0)+IF(AND(D11=\"Ja\",F39=\"Nej\"),D39* IF(D8>261,(IF(F39=\"Ja\",260-'Format ark'!D13,260)),IF(D8<=260,IF(F39=\"Ja\",D8-'Format ark'!D13,D8))),0)+IF(AND(D11=\"Ja\",F40=\"Nej\"),D40* IF(D8>261,(IF(F40=\"Ja\",260-'Format ark'!D13,260)),IF(D8<=260,IF(F40=\"Ja\",D8-'Format ark'!D13,D8))),0)","v":0}]
[null,"Estimeret VEU-godtgørelse",null,{"$f":"IF(AND(D11=\"Ja\",F29=\"Ja\"),D29*'Format ark'!D13,0)+IF(AND(D11=\"Ja\",F30=\"Ja\"),D30*'Format ark'!D13,0)+IF(AND(D11=\"Ja\",F31=\"Ja\"),D31*'Format ark'!D13,0)+IF(AND(D11=\"Ja\",F32=\"Ja\"),D32*('Format ark'!D13),0)+IF(AND(D11=\"Ja\",F33=\"Ja\"),D33*'Format ark'!D13,0)+IF(AND(D11=\"Ja\",F34=\"Ja\"),D34*'Format ark'!D13,0)+IF(AND(D11=\"Ja\",F35=\"Ja\"),D35*'Format ark'!D13,0)+IF(AND(D11=\"Ja\",F36=\"Ja\"),D36*'Format ark'!D13,0)+IF(AND(D11=\"Ja\",F37=\"Ja\"),D37*'Format ark'!D13,0)+IF(AND(D11=\"Ja\",F38=\"Ja\"),D38*'Format ark'!D13,0)+IF(AND(D11=\"Ja\",F39=\"Ja\"),D39*'Format ark'!D13,0)+IF(AND(D11=\"Ja\",F40=\"Ja\"),D40*'Format ark'!D13,0)","v":0}]
[null,"Samlet deltagerbetaling (udregner selv)",null,{"$f":"SUM(E29:E40)","v":0}]
[]
[null,"Praktik"]
[null,"Navn på virksomhed og p-nummer"]
[null,"Medarbejderens timeforbrug",null,null,{"$f":"IF(D48>C51*0.5,\"Praktik må maksimalt udgøre 50% af det samlede tidsforbrug.\",\" \")","v":" "}]
[null,"Samlet lønkompensation for praktikopholdet",null,{"$f":"IF(D48>C51*0.5,\"IKKE MULIGT\",D48*(IF(D8>261,260,D8)))","v":0}]
[]
[null,"Samlet tidsforbrug ",{"$f":"IF(D48+D41+D23>300,\"IKKE MULIGT\",D48+D41+D23)","v":0},{"$f":"IF(C51>300,\"Det maksimale tidsforbrug er 300 timer\",\" \")","v":" "}]
[]
[null,"Tidsforbrug til administration","Antal timer","Beløb"]
[null,"Der kan godtgøres op til 5 timer.",null,{"$f":"IF(C54>5,\"Der kan maksimalt godtgøres 5 timer pr. medarbejder.\",C54*260)","v":0}]
[]
[null,"Samlet tilsagnsramme i kr. (maksimal støtte til sporskiftepakken): ",null,{"$f":"IF(AND(C51>300,D49+D44+D42+D26+D24+D54<D63+1),0,MIN(D49+D44+D42+D26+D24+D54,120000))","v":{"$error":"#REF!"}},{"$f":"IF(D56=120000,\"Det maksimale tilsagn pr. sporskiftepakke er nået, og det overstigende beløb er derfor selvbetaling.\",\"\")","v":{"$error":"#REF!"}}]
[]
[]
[null,"Estimeret VEU-godtgørelse",null,{"$f":"D43+D25","v":0}]
[]
[null,"Selvbetaling i kr. (udgifter udover den øvre tilsagnsramme)",null,{"$f":"IF(C51>300,0,MAX(D49+D54+D44+D42+D24+D26-D56,0))","v":{"$error":"#REF!"}}]
[]
[null,"Tilsagnsbeløb i kr.",null,{"$f":"Slutregnskab!J10","v":{"$error":"#REF!"}}]

{"sheet":"Medarbejder 8","index":9,"n_rows":63,"n_cols":6,"rows_kept":63,"cut":false,"hidden":true,"merged":[[62,1,62,2],[60,1,60,2],[16,1,16,2],[33,1,33,2],[58,1,58,2],[46,1,46,2],[34,1,34,2],[22,1,22,2],[23,1,23,2],[24,1,24,2],[25,1,25,2],[27,1,27,2],[28,1,28,2],[29,1,29,2],[30,1,30,2],[31,1,31,2],[8,4,8,5],[21,1,21,2],[9,1,9,2],[9,4,9,5],[10,1,10,2],[11,1,11,3],[12,1,12,3],[14,1,14,3],[17,1,17,2],[18,1,18,2],[19,1,19,2],[20,1,20,2],[1,1,1,3],[3,1,3,3],[5,1,5,2],[6,1,6,2],[8,1,8,2],[7,1,7,2],[32,1,32,2],[48,1,48,2],[55,1,56,2],[55,3,56,3],[47,1,47,2],[35,1,35,2],[36,1,36,2],[37,1,37,2],[38,1,38,2],[39,1,39,2],[40,1,40,2],[41,1,41,2],[42,1,42,2],[43,1,43,2],[45,1,45,2]]}
[]
[null,"Slutregnskab for sporskiftepakken"]
[]
[null,"Oplysninger om medarbejderen"]
[]
[null,"Medarbejderens navn"]
[null,"Medarbejderens lønkompensation fra sporskifte (kr./t.)",null,{"$f":"IF(D8>261,(IF(D11=\"Ja\",260-'Format ark'!D13,260)),IF(D8<=260,IF(D11=\"Ja\",IF(D8<'Format ark'!D13,0,D8-'Format ark'!D13),D8)))","v":0}]
[null,"Medarbejderens timesats (kr./t.)"]
[null,"Medarbejderens højst gennemførte uddannelse",null,null,{"$f":"IF(D9=\"\",\"Husk at vælge medarbejderens højst gennemførte uddannelse.\",\" \")","v":"Husk at vælge medarbejderens højst gennemførte uddannelse."}]
[null,"Har medarbejderen brugt sin uddannelse de senest 5 år?",null,null,{"$f":"IF(D10=\"\",\"Husk at svare på spørgsmålet.\",\" \")","v":"Husk at svare på spørgsmålet."}]
[null,"Medarbejder formodes at være berettiget til at få VEU-godtgørelse ",null,{"$f":"IF(OR(D9=\"Videregående uddannelse\",D9=\"Gymnasial uddannelse\")*AND(D10=\"ja\"),\"Nej\",\"Ja\")","v":"Ja"}]
[null,"Beskriv herunder hvad formålet med den planlagte sporskiftepakke er for medarbejderen:"]
[]
[]
[null,"Aktiviteter"]
[]
[null,"Afklaring, vejledning mv. \nSkriv navn på kursus",null,"Medarbejderens timeforbug (timer)","Evt. deltagerbetaling (kr.)","Giver kurset ret til VEU-godtgørelse?"]
[]
[]
[]
[]
[]
[null,"Samlet antal timer (udregner selv)",null,{"$f":"SUM(D18:D22)","v":0}]
[null,"Samlet lønkompensation udover evt. VEU-godtgørelse (udregner selv)",null,{"$f":"IF(D11=\"Nej\",D23*D7,0)+IF(AND(D11=\"Ja\",F18=\"Ja\"),D18*D7,0)+IF(AND(D11=\"Ja\",F19=\"Ja\"),D19*D7,0)+IF(AND(D11=\"Ja\",F20=\"Ja\"),D20*D7,0)+IF(AND(D11=\"Ja\",F21=\"Ja\"),D21*D7,0)+IF(AND(D11=\"Ja\",F22=\"Ja\"),D22*D7,0)+IF(AND(D11=\"Ja\",F18=\"Nej\"),D18*IF(D8>261,(IF(F18=\"Ja\",260-'Format ark'!D13,260)),IF(D8<=260,IF(F18=\"Ja\",D8-'Format ark'!D13,D8))),0)+IF(AND(D11=\"Ja\",F19=\"Nej\"),D19*IF(D8>261,(IF(F19=\"Ja\",260-'Format ark'!D13,260)),IF(D8<=260,IF(F19=\"Ja\",D8-'Format ark'!D13,D8))),0)+IF(AND(D11=\"Ja\",F20=\"Nej\"),D20*IF(D8>261,(IF(F20=\"Ja\",260-'Format ark'!D13,260)),IF(D8<=260,IF(F20=\"Ja\",D8-'Format ark'!D13,D8))),0)+IF(AND(D11=\"Ja\",F21=\"Nej\"),D21*IF(D8>261,(IF(F21=\"Ja\",260-'Format ark'!D13,260)),IF(D8<=260,IF(F21=\"Ja\",D8-'Format ark'!D13,D8))),0)+IF(AND(D11=\"Ja\",F22=\"Nej\"),D22*IF(D8>261,(IF(F22=\"Ja\",260-'Format ark'!D13,260)),IF(D8<=260,IF(F22=\"Ja\",D8-'Format ark'!D13,D8))),0)","v":0}]
[null,"Estimeret VEU-godtgørelse",null,{"$f":"IF(AND(D11=\"Ja\",F18=\"Ja\"),D18*'Format ark'!D13,0)+IF(AND(D11=\"Ja\",F19=\"Ja\"),D19*'Format ark'!D13,0)+IF(AND(D11=\"Ja\",F20=\"Ja\"),D20*'Format ark'!D13,0)+IF(AND(D11=\"Ja\",F21=\"Ja\"),D21*'Format ark'!D13,0)+IF(AND(D11=\"Ja\",F22=\"Ja\"),D22*'Format ark'!D13,0)","v":0}]
[null,"Samlet deltagerbeltaing (udregner selv)",null,{"$f":"SUM(E18:E22)","v":0}]
[]
[null,"Erhversrettet efteruddannelse\nSkriv navn på efteruddannelse",null,"Medarbejderens timeforbrug (timer)","Evt. deltagerbetaling (kr.)","Giver kurset ret til VEU-godtgørelse?"]
[]
[]
[]
[]
[]
[]
[]
[]
[]
[]
[]
[]
[null,"Samlet antal timer (udregner selv)",null,{"$f":"SUM(D29:D40)","v":0}]
[null,"Samlet lønkompensation udover evt. VEU-godtgørelse (udregner selv)",null,{"$f":"IF(D11=\"Nej\",D41*D7,0)+IF(AND(D11=\"Ja\",F29=\"Ja\"),D29*D7,0)+IF(AND(D11=\"Ja\",F30=\"Ja\"),D30*D7,0)+IF(AND(D11=\"Ja\",F31=\"Ja\"),D31*D7,0)+IF(AND(D11=\"Ja\",F32=\"Ja\"),D32*D7,0)+IF(AND(D11=\"Ja\",F33=\"Ja\"),D33*D7,0)+IF(AND(D11=\"Ja\",F34=\"Ja\"),D34*D7,0)+IF(AND(D11=\"Ja\",F35=\"Ja\"),D35*D7,0)+IF(AND(D11=\"Ja\",F36=\"Ja\"),D36*D7,0)+IF(AND(D11=\"Ja\",F37=\"Ja\"),D37*D7,0)+IF(AND(D11=\"Ja\",F38=\"Ja\"),D38*D7,0)+IF(AND(D11=\"Ja\",F39=\"Ja\"),D39*D7,0)+IF(AND(D11=\"Ja\",F40=\"Ja\"),D40*D7,0)+IF(AND(D11=\"Ja\",F29=\"Nej\"),D29* IF(D8>261,(IF(F29=\"Ja\",260-'Format ark'!D13,260)),IF(D8<=260,IF(F29=\"Ja\",D8-'Format ark'!D13,D8))),0)+IF(AND(D11=\"Ja\",F30=\"Nej\"),D30* IF(D8>261,(IF(F30=\"Ja\",260-'Format ark'!D13,260)),IF(D8<=260,IF(F30=\"Ja\",D8-'Format ark'!D13,D8))),0)+IF(AND(D11=\"Ja\",F31=\"Nej\"),D31* IF(D8>261,(IF(F31=\"Ja\",260-'Format ark'!D13,260)),IF(D8<=260,IF(F31=\"Ja\",D8-'Format ark'!D13,D8))),0)+IF(AND(D11=\"Ja\",F32=\"Nej\"),D32* IF(D8>261,(IF(F32=\"Ja\",260-'Format ark'!D13,260)),IF(D8<=260,IF(F32=\"Ja\",D8-'Format ark'!D13,D8))),0)+IF(AND(D11=\"Ja\",F33=\"Nej\"),D33* IF(D8>261,(IF(F33=\"Ja\",260-'Format ark'!D13,260)),IF(D8<=260,IF(F33=\"Ja\",D8-'Format ark'!D13,D8))),0)+IF(AND(D11=\"Ja\",F34=\"Nej\"),D34* IF(D8>261,(IF(F34=\"Ja\",260-'Format ark'!D13,260)),IF(D8<=260,IF(F34=\"Ja\",D8-'Format ark'!D13,D8))),0)+IF(AND(D11=\"Ja\",F35=\"Nej\"),D35* IF(D8>261,(IF(F35=\"Ja\",260-'Format ark'!D13,260)),IF(D8<=260,IF(F35=\"Ja\",D8-'Format ark'!D13,D8))),0)+IF(AND(D11=\"Ja\",F36=\"Nej\"),D36* IF(D8>261,(IF(F36=\"Ja\",260-'Format ark'!D13,260)),IF(D8<=260,IF(F36=\"Ja\",D8-'Format ark'!D13,D8))),0)+IF(AND(D11=\"Ja\",F37=\"Nej\"),D37* IF(D8>261,(IF(F37=\"Ja\",260-'Format ark'!D13,260)),IF(D8<=260,IF(F37=\"Ja\",D8-'Format ark'!D13,D8))),0)+IF(AND(D11=\"Ja\",F38=\"Nej\"),D38* IF(D8>261,(IF(F38=\"Ja\",260-'Format ark'!D13,260)),IF(D8<=260,IF(F38=\"Ja\",D8-'Format ark'!D13,D8))),0)+IF(AND(D11=\"Ja\",F39=\"Nej\"),D39* IF(D8>261,(IF(F39=\"Ja\",260-'Format ark'!D13,260)),IF(D8<=260,IF(F39=\"Ja\",D8-'Format ark'!D13,D8))),0)+IF(AND(D11=\"Ja\",F40=\"Nej\"),D40* IF(D8>261,(IF(F40=\"Ja\",260-'Format ark'!D13,260)),IF(D8<=260,IF(F40=\"Ja\",D8-'Format ark'!D13,D8))),0)","v":0}]
[null,"Estimeret VEU-godtgørelse",null,{"$f":"IF(AND(D11=\"Ja\",F29=\"Ja\"),D29*'Format ark'!D13,0)+IF(AND(D11=\"Ja\",F30=\"Ja\"),D30*'Format ark'!D13,0)+IF(AND(D11=\"Ja\",F31=\"Ja\"),D31*'Format ark'!D13,0)+IF(AND(D11=\"Ja\",F32=\"Ja\"),D32*('Format ark'!D13),0)+IF(AND(D11=\"Ja\",F33=\"Ja\"),D33*'Format ark'!D13,0)+IF(AND(D11=\"Ja\",F34=\"Ja\"),D34*'Format ark'!D13,0)+IF(AND(D11=\"Ja\",F35=\"Ja\"),D35*'Format ark'!D13,0)+IF(AND(D11=\"Ja\",F36=\"Ja\"),D36*'Format ark'!D13,0)+IF(AND(D11=\"Ja\",F37=\"Ja\"),D37*'Format ark'!D13,0)+IF(AND(D11=\"Ja\",F38=\"Ja\"),D38*'Format ark'!D13,0)+IF(AND(D11=\"Ja\",F39=\"Ja\"),D39*'Format ark'!D13,0)+IF(AND(D11=\"Ja\",F40=\"Ja\"),D40*'Format ark'!D13,0)","v":0}]
[null,"Samlet deltagerbetaling (udregner selv)",null,{"$f":"SUM(E29:E40)","v":0}]
[]
[null,"Praktik"]
[null,"Navn på virksomhed og p-nummer"]
[null,"Medarbejderens timeforbrug",null,null,{"$f":"IF(D48>C51*0.5,\"Praktik må maksimalt udgøre 50% af det samlede tidsforbrug.\",\" \")","v":" "}]
[null,"Samlet lønkompensation for praktikopholdet",null,{"$f":"IF(D48>C51*0.5,\"IKKE MULIGT\",D48*(IF(D8>261,260,D8)))","v":0}]
[]
[null,"Samlet tidsforbrug ",{"$f":"IF(D48+D41+D23>300,\"IKKE MULIGT\",D48+D41+D23)","v":0},{"$f":"IF(C51>300,\"Det maksimale tidsforbrug er 300 timer\",\" \")","v":" "}]
[]
[null,"Tidsforbrug til administration","Antal timer","Beløb"]
[null,"Der kan godtgøres op til 5 timer.",null,{"$f":"IF(C54>5,\"Der kan maksimalt godtgøres 5 timer pr. medarbejder.\",C54*260)","v":0}]
[]
[null,"Samlet tilsagnsramme i kr. (maksimal støtte til sporskiftepakken): ",null,{"$f":"IF(AND(C51>300,D49+D44+D42+D26+D24+D54<D63+1),0,MIN(D49+D44+D42+D26+D24+D54,120000))","v":{"$error":"#REF!"}},{"$f":"IF(D56=120000,\"Det maksimale tilsagn pr. sporskiftepakke er nået, og det overstigende beløb er derfor selvbetaling.\",\"\")","v":{"$error":"#REF!"}}]
[]
[]
[null,"Estimeret VEU-godtgørelse",null,{"$f":"D43+D25","v":0}]
[]
[null,"Selvbetaling i kr. (udgifter udover den øvre tilsagnsramme)",null,{"$f":"IF(C51>300,0,MAX(D49+D54+D44+D42+D24+D26-D56,0))","v":{"$error":"#REF!"}}]
[]
[null,"Tilsagnsbeløb i kr.",null,{"$f":"Slutregnskab!J10","v":{"$error":"#REF!"}}]

{"sheet":"Medarbejder 9","index":10,"n_rows":63,"n_cols":6,"rows_kept":63,"cut":false,"hidden":true,"merged":[[62,1,62,2],[60,1,60,2],[16,1,16,2],[33,1,33,2],[58,1,58,2],[46,1,46,2],[34,1,34,2],[22,1,22,2],[23,1,23,2],[24,1,24,2],[25,1,25,2],[27,1,27,2],[28,1,28,2],[29,1,29,2],[30,1,30,2],[31,1,31,2],[8,4,8,5],[21,1,21,2],[9,1,9,2],[9,4,9,5],[10,1,10,2],[11,1,11,3],[12,1,12,3],[14,1,14,3],[17,1,17,2],[18,1,18,2],[19,1,19,2],[20,1,20,2],[1,1,1,3],[3,1,3,3],[5,1,5,2],[6,1,6,2],[8,1,8,2],[7,1,7,2],[32,1,32,2],[48,1,48,2],[55,1,56,2],[55,3,56,3],[47,1,47,2],[35,1,35,2],[36,1,36,2],[37,1,37,2],[38,1,38,2],[39,1,39,2],[40,1,40,2],[41,1,41,2],[42,1,42,2],[43,1,43,2],[45,1,45,2]]}
[]
[null,"Slutregnskab for sporskiftepakken"]
[]
[null,"Oplysninger om medarbejderen"]
[]
[null,"Medarbejderens navn"]
[null,"Medarbejderens lønkompensation fra sporskifte (kr./t.)",null,{"$f":"IF(D8>261,(IF(D11=\"Ja\",260-'Format ark'!D13,260)),IF(D8<=260,IF(D11=\"Ja\",IF(D8<'Format ark'!D13,0,D8-'Format ark'!D13),D8)))","v":0}]
[null,"Medarbejderens timesats (kr./t.)"]
[null,"Medarbejderens højst gennemførte uddannelse",null,null,{"$f":"IF(D9=\"\",\"Husk at vælge medarbejderens højst gennemførte uddannelse.\",\" \")","v":"Husk at vælge medarbejderens højst gennemførte uddannelse."}]
[null,"Har medarbejderen brugt sin uddannelse de senest 5 år?",null,null,{"$f":"IF(D10=\"\",\"Husk at svare på spørgsmålet.\",\" \")","v":"Husk at svare på spørgsmålet."}]
[null,"Medarbejder formodes at være berettiget til at få VEU-godtgørelse ",null,{"$f":"IF(OR(D9=\"Videregående uddannelse\",D9=\"Gymnasial uddannelse\")*AND(D10=\"ja\"),\"Nej\",\"Ja\")","v":"Ja"}]
[null,"Beskriv herunder hvad formålet med den planlagte sporskiftepakke er for medarbejderen:"]
[]
[]
[null,"Aktiviteter"]
[]
[null,"Afklaring, vejledning mv. \nSkriv navn på kursus",null,"Medarbejderens timeforbug (timer)","Evt. deltagerbetaling (kr.)","Giver kurset ret til VEU-godtgørelse?"]
[]
[]
[]
[]
[]
[null,"Samlet antal timer (udregner selv)",null,{"$f":"SUM(D18:D22)","v":0}]
[null,"Samlet lønkompensation udover evt. VEU-godtgørelse (udregner selv)",null,{"$f":"IF(D11=\"Nej\",D23*D7,0)+IF(AND(D11=\"Ja\",F18=\"Ja\"),D18*D7,0)+IF(AND(D11=\"Ja\",F19=\"Ja\"),D19*D7,0)+IF(AND(D11=\"Ja\",F20=\"Ja\"),D20*D7,0)+IF(AND(D11=\"Ja\",F21=\"Ja\"),D21*D7,0)+IF(AND(D11=\"Ja\",F22=\"Ja\"),D22*D7,0)+IF(AND(D11=\"Ja\",F18=\"Nej\"),D18*IF(D8>261,(IF(F18=\"Ja\",260-'Format ark'!D13,260)),IF(D8<=260,IF(F18=\"Ja\",D8-'Format ark'!D13,D8))),0)+IF(AND(D11=\"Ja\",F19=\"Nej\"),D19*IF(D8>261,(IF(F19=\"Ja\",260-'Format ark'!D13,260)),IF(D8<=260,IF(F19=\"Ja\",D8-'Format ark'!D13,D8))),0)+IF(AND(D11=\"Ja\",F20=\"Nej\"),D20*IF(D8>261,(IF(F20=\"Ja\",260-'Format ark'!D13,260)),IF(D8<=260,IF(F20=\"Ja\",D8-'Format ark'!D13,D8))),0)+IF(AND(D11=\"Ja\",F21=\"Nej\"),D21*IF(D8>261,(IF(F21=\"Ja\",260-'Format ark'!D13,260)),IF(D8<=260,IF(F21=\"Ja\",D8-'Format ark'!D13,D8))),0)+IF(AND(D11=\"Ja\",F22=\"Nej\"),D22*IF(D8>261,(IF(F22=\"Ja\",260-'Format ark'!D13,260)),IF(D8<=260,IF(F22=\"Ja\",D8-'Format ark'!D13,D8))),0)","v":0}]
[null,"Estimeret VEU-godtgørelse",null,{"$f":"IF(AND(D11=\"Ja\",F18=\"Ja\"),D18*'Format ark'!D13,0)+IF(AND(D11=\"Ja\",F19=\"Ja\"),D19*'Format ark'!D13,0)+IF(AND(D11=\"Ja\",F20=\"Ja\"),D20*'Format ark'!D13,0)+IF(AND(D11=\"Ja\",F21=\"Ja\"),D21*'Format ark'!D13,0)+IF(AND(D11=\"Ja\",F22=\"Ja\"),D22*'Format ark'!D13,0)","v":0}]
[null,"Samlet deltagerbeltaing (udregner selv)",null,{"$f":"SUM(E18:E22)","v":0}]
[]
[null,"Erhversrettet efteruddannelse\nSkriv navn på efteruddannelse",null,"Medarbejderens timeforbrug (timer)","Evt. deltagerbetaling (kr.)","Giver kurset ret til VEU-godtgørelse?"]
[]
[]
[]
[]
[]
[]
[]
[]
[]
[]
[]
[]
[null,"Samlet antal timer (udregner selv)",null,{"$f":"SUM(D29:D40)","v":0}]
[null,"Samlet lønkompensation udover evt. VEU-godtgørelse (udregner selv)",null,{"$f":"IF(D11=\"Nej\",D41*D7,0)+IF(AND(D11=\"Ja\",F29=\"Ja\"),D29*D7,0)+IF(AND(D11=\"Ja\",F30=\"Ja\"),D30*D7,0)+IF(AND(D11=\"Ja\",F31=\"Ja\"),D31*D7,0)+IF(AND(D11=\"Ja\",F32=\"Ja\"),D32*D7,0)+IF(AND(D11=\"Ja\",F33=\"Ja\"),D33*D7,0)+IF(AND(D11=\"Ja\",F34=\"Ja\"),D34*D7,0)+IF(AND(D11=\"Ja\",F35=\"Ja\"),D35*D7,0)+IF(AND(D11=\"Ja\",F36=\"Ja\"),D36*D7,0)+IF(AND(D11=\"Ja\",F37=\"Ja\"),D37*D7,0)+IF(AND(D11=\"Ja\",F38=\"Ja\"),D38*D7,0)+IF(AND(D11=\"Ja\",F39=\"Ja\"),D39*D7,0)+IF(AND(D11=\"Ja\",F40=\"Ja\"),D40*D7,0)+IF(AND(D11=\"Ja\",F29=\"Nej\"),D29* IF(D8>261,(IF(F29=\"Ja\",260-'Format ark'!D13,260)),IF(D8<=260,IF(F29=\"Ja\",D8-'Format ark'!D13,D8))),0)+IF(AND(D11=\"Ja\",F30=\"Nej\"),D30* IF(D8>261,(IF(F30=\"Ja\",260-'Format ark'!D13,260)),IF(D8<=260,IF(F30=\"Ja\",D8-'Format ark'!D13,D8))),0)+IF(AND(D11=\"Ja\",F31=\"Nej\"),D31* IF(D8>261,(IF(F31=\"Ja\",260-'Format ark'!D13,260)),IF(D8<=260,IF(F31=\"Ja\",D8-'Format ark'!D13,D8))),0)+IF(AND(D11=\"Ja\",F32=\"Nej\"),D32* IF(D8>261,(IF(F32=\"Ja\",260-'Format ark'!D13,260)),IF(D8<=260,IF(F32=\"Ja\",D8-'Format ark'!D13,D8))),0)+IF(AND(D11=\"Ja\",F33=\"Nej\"),D33* IF(D8>261,(IF(F33=\"Ja\",260-'Format ark'!D13,260)),IF(D8<=260,IF(F33=\"Ja\",D8-'Format ark'!D13,D8))),0)+IF(AND(D11=\"Ja\",F34=\"Nej\"),D34* IF(D8>261,(IF(F34=\"Ja\",260-'Format ark'!D13,260)),IF(D8<=260,IF(F34=\"Ja\",D8-'Format ark'!D13,D8))),0)+IF(AND(D11=\"Ja\",F35=\"Nej\"),D35* IF(D8>261,(IF(F35=\"Ja\",260-'Format ark'!D13,260)),IF(D8<=260,IF(F35=\"Ja\",D8-'Format ark'!D13,D8))),0)+IF(AND(D11=\"Ja\",F36=\"Nej\"),D36* IF(D8>261,(IF(F36=\"Ja\",260-'Format ark'!D13,260)),IF(D8<=260,IF(F36=\"Ja\",D8-'Format ark'!D13,D8))),0)+IF(AND(D11=\"Ja\",F37=\"Nej\"),D37* IF(D8>261,(IF(F37=\"Ja\",260-'Format ark'!D13,260)),IF(D8<=260,IF(F37=\"Ja\",D8-'Format ark'!D13,D8))),0)+IF(AND(D11=\"Ja\",F38=\"Nej\"),D38* IF(D8>261,(IF(F38=\"Ja\",260-'Format ark'!D13,260)),IF(D8<=260,IF(F38=\"Ja\",D8-'Format ark'!D13,D8))),0)+IF(AND(D11=\"Ja\",F39=\"Nej\"),D39* IF(D8>261,(IF(F39=\"Ja\",260-'Format ark'!D13,260)),IF(D8<=260,IF(F39=\"Ja\",D8-'Format ark'!D13,D8))),0)+IF(AND(D11=\"Ja\",F40=\"Nej\"),D40* IF(D8>261,(IF(F40=\"Ja\",260-'Format ark'!D13,260)),IF(D8<=260,IF(F40=\"Ja\",D8-'Format ark'!D13,D8))),0)","v":0}]
[null,"Estimeret VEU-godtgørelse",null,{"$f":"IF(AND(D11=\"Ja\",F29=\"Ja\"),D29*'Format ark'!D13,0)+IF(AND(D11=\"Ja\",F30=\"Ja\"),D30*'Format ark'!D13,0)+IF(AND(D11=\"Ja\",F31=\"Ja\"),D31*'Format ark'!D13,0)+IF(AND(D11=\"Ja\",F32=\"Ja\"),D32*('Format ark'!D13),0)+IF(AND(D11=\"Ja\",F33=\"Ja\"),D33*'Format ark'!D13,0)+IF(AND(D11=\"Ja\",F34=\"Ja\"),D34*'Format ark'!D13,0)+IF(AND(D11=\"Ja\",F35=\"Ja\"),D35*'Format ark'!D13,0)+IF(AND(D11=\"Ja\",F36=\"Ja\"),D36*'Format ark'!D13,0)+IF(AND(D11=\"Ja\",F37=\"Ja\"),D37*'Format ark'!D13,0)+IF(AND(D11=\"Ja\",F38=\"Ja\"),D38*'Format ark'!D13,0)+IF(AND(D11=\"Ja\",F39=\"Ja\"),D39*'Format ark'!D13,0)+IF(AND(D11=\"Ja\",F40=\"Ja\"),D40*'Format ark'!D13,0)","v":0}]
[null,"Samlet deltagerbetaling (udregner selv)",null,{"$f":"SUM(E29:E40)","v":0}]
[]
[null,"Praktik"]
[null,"Navn på virksomhed og p-nummer"]
[null,"Medarbejderens timeforbrug",null,null,{"$f":"IF(D48>C51*0.5,\"Praktik må maksimalt udgøre 50% af det samlede tidsforbrug.\",\" \")","v":" "}]
[null,"Samlet lønkompensation for praktikopholdet",null,{"$f":"IF(D48>C51*0.5,\"IKKE MULIGT\",D48*(IF(D8>261,260,D8)))","v":0}]
[]
[null,"Samlet tidsforbrug ",{"$f":"IF(D48+D41+D23>300,\"IKKE MULIGT\",D48+D41+D23)","v":0},{"$f":"IF(C51>300,\"Det maksimale tidsforbrug er 300 timer\",\" \")","v":" "}]
[]
[null,"Tidsforbrug til administration","Antal timer","Beløb"]
[null,"Der kan godtgøres op til 5 timer.",null,{"$f":"IF(C54>5,\"Der kan maksimalt godtgøres 5 timer pr. medarbejder.\",C54*260)","v":0}]
[]
[null,"Samlet tilsagnsramme i kr. (maksimal støtte til sporskiftepakken): ",null,{"$f":"IF(AND(C51>300,D49+D44+D42+D26+D24+D54<D63+1),0,MIN(D49+D44+D42+D26+D24+D54,120000))","v":{"$error":"#REF!"}},{"$f":"IF(D56=120000,\"Det maksimale tilsagn pr. sporskiftepakke er nået, og det overstigende beløb er derfor selvbetaling.\",\"\")","v":{"$error":"#REF!"}}]
[]
[]
[null,"Estimeret VEU-godtgørelse",null,{"$f":"D43+D25","v":0}]
[]
[null,"Selvbetaling i kr. (udgifter udover den øvre tilsagnsramme)",null,{"$f":"IF(C51>300,0,MAX(D49+D54+D44+D42+D24+D26-D56,0))","v":{"$error":"#REF!"}}]
[]
[null,"Tilsagnsbeløb i kr.",null,{"$f":"Slutregnskab!J10","v":{"$error":"#REF!"}}]

{"sheet":"Medarbejder 10","index":11,"n_rows":63,"n_cols":6,"rows_kept":63,"cut":false,"hidden":true,"merged":[[62,1,62,2],[60,1,60,2],[16,1,16,2],[33,1,33,2],[58,1,58,2],[46,1,46,2],[34,1,34,2],[22,1,22,2],[23,1,23,2],[24,1,24,2],[25,1,25,2],[27,1,27,2],[28,1,28,2],[29,1,29,2],[30,1,30,2],[31,1,31,2],[8,4,8,5],[21,1,21,2],[9,1,9,2],[9,4,9,5],[10,1,10,2],[11,1,11,3],[12,1,12,3],[14,1,14,3],[17,1,17,2],[18,1,18,2],[19,1,19,2],[20,1,20,2],[1,1,1,3],[3,1,3,3],[5,1,5,2],[6,1,6,2],[8,1,8,2],[7,1,7,2],[32,1,32,2],[48,1,48,2],[55,1,56,2],[55,3,56,3],[47,1,47,2],[35,1,35,2],[36,1,36,2],[37,1,37,2],[38,1,38,2],[39,1,39,2],[40,1,40,2],[41,1,41,2],[42,1,42,2],[43,1,43,2],[45,1,45,2]]}
[]
[null,"Slutregnskab for sporskiftepakken"]
[]
[null,"Oplysninger om medarbejderen"]
[]
[null,"Medarbejderens navn"]
[null,"Medarbejderens lønkompensation fra sporskifte (kr./t.)",null,{"$f":"IF(D8>261,(IF(D11=\"Ja\",260-'Format ark'!D13,260)),IF(D8<=260,IF(D11=\"Ja\",IF(D8<'Format ark'!D13,0,D8-'Format ark'!D13),D8)))","v":0}]
[null,"Medarbejderens timesats (kr./t.)"]
[null,"Medarbejderens højst gennemførte uddannelse",null,null,{"$f":"IF(D9=\"\",\"Husk at vælge medarbejderens højst gennemførte uddannelse.\",\" \")","v":"Husk at vælge medarbejderens højst gennemførte uddannelse."}]
[null,"Har medarbejderen brugt sin uddannelse de senest 5 år?",null,null,{"$f":"IF(D10=\"\",\"Husk at svare på spørgsmålet.\",\" \")","v":"Husk at svare på spørgsmålet."}]
[null,"Medarbejder formodes at være berettiget til at få VEU-godtgørelse ",null,{"$f":"IF(OR(D9=\"Videregående uddannelse\",D9=\"Gymnasial uddannelse\")*AND(D10=\"ja\"),\"Nej\",\"Ja\")","v":"Ja"}]
[null,"Beskriv herunder hvad formålet med den planlagte sporskiftepakke er for medarbejderen:"]
[]
[]
[null,"Aktiviteter"]
[]
[null,"Afklaring, vejledning mv. \nSkriv navn på kursus",null,"Medarbejderens timeforbug (timer)","Evt. deltagerbetaling (kr.)","Giver kurset ret til VEU-godtgørelse?"]
[]
[]
[]
[]
[]
[null,"Samlet antal timer (udregner selv)",null,{"$f":"SUM(D18:D22)","v":0}]
[null,"Samlet lønkompensation udover evt. VEU-godtgørelse (udregner selv)",null,{"$f":"IF(D11=\"Nej\",D23*D7,0)+IF(AND(D11=\"Ja\",F18=\"Ja\"),D18*D7,0)+IF(AND(D11=\"Ja\",F19=\"Ja\"),D19*D7,0)+IF(AND(D11=\"Ja\",F20=\"Ja\"),D20*D7,0)+IF(AND(D11=\"Ja\",F21=\"Ja\"),D21*D7,0)+IF(AND(D11=\"Ja\",F22=\"Ja\"),D22*D7,0)+IF(AND(D11=\"Ja\",F18=\"Nej\"),D18*IF(D8>261,(IF(F18=\"Ja\",260-'Format ark'!D13,260)),IF(D8<=260,IF(F18=\"Ja\",D8-'Format ark'!D13,D8))),0)+IF(AND(D11=\"Ja\",F19=\"Nej\"),D19*IF(D8>261,(IF(F19=\"Ja\",260-'Format ark'!D13,260)),IF(D8<=260,IF(F19=\"Ja\",D8-'Format ark'!D13,D8))),0)+IF(AND(D11=\"Ja\",F20=\"Nej\"),D20*IF(D8>261,(IF(F20=\"Ja\",260-'Format ark'!D13,260)),IF(D8<=260,IF(F20=\"Ja\",D8-'Format ark'!D13,D8))),0)+IF(AND(D11=\"Ja\",F21=\"Nej\"),D21*IF(D8>261,(IF(F21=\"Ja\",260-'Format ark'!D13,260)),IF(D8<=260,IF(F21=\"Ja\",D8-'Format ark'!D13,D8))),0)+IF(AND(D11=\"Ja\",F22=\"Nej\"),D22*IF(D8>261,(IF(F22=\"Ja\",260-'Format ark'!D13,260)),IF(D8<=260,IF(F22=\"Ja\",D8-'Format ark'!D13,D8))),0)","v":0}]
[null,"Estimeret VEU-godtgørelse",null,{"$f":"IF(AND(D11=\"Ja\",F18=\"Ja\"),D18*'Format ark'!D13,0)+IF(AND(D11=\"Ja\",F19=\"Ja\"),D19*'Format ark'!D13,0)+IF(AND(D11=\"Ja\",F20=\"Ja\"),D20*'Format ark'!D13,0)+IF(AND(D11=\"Ja\",F21=\"Ja\"),D21*'Format ark'!D13,0)+IF(AND(D11=\"Ja\",F22=\"Ja\"),D22*'Format ark'!D13,0)","v":0}]
[null,"Samlet deltagerbeltaing (udregner selv)",null,{"$f":"SUM(E18:E22)","v":0}]
[]
[null,"Erhversrettet efteruddannelse\nSkriv navn på efteruddannelse",null,"Medarbejderens timeforbrug (timer)","Evt. deltagerbetaling (kr.)","Giver kurset ret til VEU-godtgørelse?"]
[]
[]
[]
[]
[]
[]
[]
[]
[]
[]
[]
[]
[null,"Samlet antal timer (udregner selv)",null,{"$f":"SUM(D29:D40)","v":0}]
[null,"Samlet lønkompensation udover evt. VEU-godtgørelse (udregner selv)",null,{"$f":"IF(D11=\"Nej\",D41*D7,0)+IF(AND(D11=\"Ja\",F29=\"Ja\"),D29*D7,0)+IF(AND(D11=\"Ja\",F30=\"Ja\"),D30*D7,0)+IF(AND(D11=\"Ja\",F31=\"Ja\"),D31*D7,0)+IF(AND(D11=\"Ja\",F32=\"Ja\"),D32*D7,0)+IF(AND(D11=\"Ja\",F33=\"Ja\"),D33*D7,0)+IF(AND(D11=\"Ja\",F34=\"Ja\"),D34*D7,0)+IF(AND(D11=\"Ja\",F35=\"Ja\"),D35*D7,0)+IF(AND(D11=\"Ja\",F36=\"Ja\"),D36*D7,0)+IF(AND(D11=\"Ja\",F37=\"Ja\"),D37*D7,0)+IF(AND(D11=\"Ja\",F38=\"Ja\"),D38*D7,0)+IF(AND(D11=\"Ja\",F39=\"Ja\"),D39*D7,0)+IF(AND(D11=\"Ja\",F40=\"Ja\"),D40*D7,0)+IF(AND(D11=\"Ja\",F29=\"Nej\"),D29* IF(D8>261,(IF(F29=\"Ja\",260-'Format ark'!D13,260)),IF(D8<=260,IF(F29=\"Ja\",D8-'Format ark'!D13,D8))),0)+IF(AND(D11=\"Ja\",F30=\"Nej\"),D30* IF(D8>261,(IF(F30=\"Ja\",260-'Format ark'!D13,260)),IF(D8<=260,IF(F30=\"Ja\",D8-'Format ark'!D13,D8))),0)+IF(AND(D11=\"Ja\",F31=\"Nej\"),D31* IF(D8>261,(IF(F31=\"Ja\",260-'Format ark'!D13,260)),IF(D8<=260,IF(F31=\"Ja\",D8-'Format ark'!D13,D8))),0)+IF(AND(D11=\"Ja\",F32=\"Nej\"),D32* IF(D8>261,(IF(F32=\"Ja\",260-'Format ark'!D13,260)),IF(D8<=260,IF(F32=\"Ja\",D8-'Format ark'!D13,D8))),0)+IF(AND(D11=\"Ja\",F33=\"Nej\"),D33* IF(D8>261,(IF(F33=\"Ja\",260-'Format ark'!D13,260)),IF(D8<=260,IF(F33=\"Ja\",D8-'Format ark'!D13,D8))),0)+IF(AND(D11=\"Ja\",F34=\"Nej\"),D34* IF(D8>261,(IF(F34=\"Ja\",260-'Format ark'!D13,260)),IF(D8<=260,IF(F34=\"Ja\",D8-'Format ark'!D13,D8))),0)+IF(AND(D11=\"Ja\",F35=\"Nej\"),D35* IF(D8>261,(IF(F35=\"Ja\",260-'Format ark'!D13,260)),IF(D8<=260,IF(F35=\"Ja\",D8-'Format ark'!D13,D8))),0)+IF(AND(D11=\"Ja\",F36=\"Nej\"),D36* IF(D8>261,(IF(F36=\"Ja\",260-'Format ark'!D13,260)),IF(D8<=260,IF(F36=\"Ja\",D8-'Format ark'!D13,D8))),0)+IF(AND(D11=\"Ja\",F37=\"Nej\"),D37* IF(D8>261,(IF(F37=\"Ja\",260-'Format ark'!D13,260)),IF(D8<=260,IF(F37=\"Ja\",D8-'Format ark'!D13,D8))),0)+IF(AND(D11=\"Ja\",F38=\"Nej\"),D38* IF(D8>261,(IF(F38=\"Ja\",260-'Format ark'!D13,260)),IF(D8<=260,IF(F38=\"Ja\",D8-'Format ark'!D13,D8))),0)+IF(AND(D11=\"Ja\",F39=\"Nej\"),D39* IF(D8>261,(IF(F39=\"Ja\",260-'Format ark'!D13,260)),IF(D8<=260,IF(F39=\"Ja\",D8-'Format ark'!D13,D8))),0)+IF(AND(D11=\"Ja\",F40=\"Nej\"),D40* IF(D8>261,(IF(F40=\"Ja\",260-'Format ark'!D13,260)),IF(D8<=260,IF(F40=\"Ja\",D8-'Format ark'!D13,D8))),0)","v":0}]
[null,"Estimeret VEU-godtgørelse",null,{"$f":"IF(AND(D11=\"Ja\",F29=\"Ja\"),D29*'Format ark'!D13,0)+IF(AND(D11=\"Ja\",F30=\"Ja\"),D30*'Format ark'!D13,0)+IF(AND(D11=\"Ja\",F31=\"Ja\"),D31*'Format ark'!D13,0)+IF(AND(D11=\"Ja\",F32=\"Ja\"),D32*('Format ark'!D13),0)+IF(AND(D11=\"Ja\",F33=\"Ja\"),D33*'Format ark'!D13,0)+IF(AND(D11=\"Ja\",F34=\"Ja\"),D34*'Format ark'!D13,0)+IF(AND(D11=\"Ja\",F35=\"Ja\"),D35*'Format ark'!D13,0)+IF(AND(D11=\"Ja\",F36=\"Ja\"),D36*'Format ark'!D13,0)+IF(AND(D11=\"Ja\",F37=\"Ja\"),D37*'Format ark'!D13,0)+IF(AND(D11=\"Ja\",F38=\"Ja\"),D38*'Format ark'!D13,0)+IF(AND(D11=\"Ja\",F39=\"Ja\"),D39*'Format ark'!D13,0)+IF(AND(D11=\"Ja\",F40=\"Ja\"),D40*'Format ark'!D13,0)","v":0}]
[null,"Samlet deltagerbetaling (udregner selv)",null,{"$f":"SUM(E29:E40)","v":0}]
[]
[null,"Praktik"]
[null,"Navn på virksomhed og p-nummer"]
[null,"Medarbejderens timeforbrug",null,null,{"$f":"IF(D48>C51*0.5,\"Praktik må maksimalt udgøre 50% af det samlede tidsforbrug.\",\" \")","v":" "}]
[null,"Samlet lønkompensation for praktikopholdet",null,{"$f":"IF(D48>C51*0.5,\"IKKE MULIGT\",D48*(IF(D8>261,260,D8)))","v":0}]
[]
[null,"Samlet tidsforbrug ",{"$f":"IF(D48+D41+D23>300,\"IKKE MULIGT\",D48+D41+D23)","v":0},{"$f":"IF(C51>300,\"Det maksimale tidsforbrug er 300 timer\",\" \")","v":" "}]
[]
[null,"Tidsforbrug til administration","Antal timer","Beløb"]
[null,"Der kan godtgøres op til 5 timer.",null,{"$f":"IF(C54>5,\"Der kan maksimalt godtgøres 5 timer pr. medarbejder.\",C54*260)","v":0}]
[]
[null,"Samlet tilsagnsramme i kr. (maksimal støtte til sporskiftepakken): ",null,{"$f":"IF(AND(C51>300,D49+D44+D42+D26+D24+D54<D63+1),0,MIN(D49+D44+D42+D26+D24+D54,120000))","v":{"$error":"#REF!"}},{"$f":"IF(D56=120000,\"Det maksimale tilsagn pr. sporskiftepakke er nået, og det overstigende beløb er derfor selvbetaling.\",\"\")","v":{"$error":"#REF!"}}]
[]
[]
[null,"Estimeret VEU-godtgørelse",null,{"$f":"D43+D25","v":0}]
[]
[null,"Selvbetaling i kr. (udgifter udover den øvre tilsagnsramme)",null,{"$f":"IF(C51>300,0,MAX(D49+D54+D44+D42+D24+D26-D56,0))","v":{"$error":"#REF!"}}]
[]
[null,"Tilsagnsbeløb i kr.",null,{"$f":"Slutregnskab!J10","v":{"$error":"#REF!"}}]

{"sheet":"Medarbejder 11","index":12,"n_rows":63,"n_cols":6,"rows_kept":63,"cut":false,"hidden":true,"merged":[[62,1,62,2],[60,1,60,2],[16,1,16,2],[33,1,33,2],[58,1,58,2],[46,1,46,2],[34,1,34,2],[22,1,22,2],[23,1,23,2],[24,1,24,2],[25,1,25,2],[27,1,27,2],[28,1,28,2],[29,1,29,2],[30,1,30,2],[31,1,31,2],[8,4,8,5],[21,1,21,2],[9,1,9,2],[9,4,9,5],[10,1,10,2],[11,1,11,3],[12,1,12,3],[14,1,14,3],[17,1,17,2],[18,1,18,2],[19,1,19,2],[20,1,20,2],[1,1,1,3],[3,1,3,3],[5,1,5,2],[6,1,6,2],[8,1,8,2],[7,1,7,2],[32,1,32,2],[48,1,48,2],[55,1,56,2],[55,3,56,3],[47,1,47,2],[35,1,35,2],[36,1,36,2],[37,1,37,2],[38,1,38,2],[39,1,39,2],[40,1,40,2],[41,1,41,2],[42,1,42,2],[43,1,43,2],[45,1,45,2]]}
[]
[null,"Slutregnskab for sporskiftepakken"]
[]
[null,"Oplysninger om medarbejderen"]
[]
[null,"Medarbejderens navn"]
[null,"Medarbejderens lønkompensation fra sporskifte (kr./t.)",null,{"$f":"IF(D8>261,(IF(D11=\"Ja\",260-'Format ark'!D13,260)),IF(D8<=260,IF(D11=\"Ja\",IF(D8<'Format ark'!D13,0,D8-'Format ark'!D13),D8)))","v":0}]
[null,"Medarbejderens timesats (kr./t.)"]
[null,"Medarbejderens højst gennemførte uddannelse",null,null,{"$f":"IF(D9=\"\",\"Husk at vælge medarbejderens højst gennemførte uddannelse.\",\" \")","v":"Husk at vælge medarbejderens højst gennemførte uddannelse."}]
[null,"Har medarbejderen brugt sin uddannelse de senest 5 år?",null,null,{"$f":"IF(D10=\"\",\"Husk at svare på spørgsmålet.\",\" \")","v":"Husk at svare på spørgsmålet."}]
[null,"Medarbejder formodes at være berettiget til at få VEU-godtgørelse ",null,{"$f":"IF(OR(D9=\"Videregående uddannelse\",D9=\"Gymnasial uddannelse\")*AND(D10=\"ja\"),\"Nej\",\"Ja\")","v":"Ja"}]
[null,"Beskriv herunder hvad formålet med den planlagte sporskiftepakke er for medarbejderen:"]
[]
[]
[null,"Aktiviteter"]
[]
[null,"Afklaring, vejledning mv. \nSkriv navn på kursus",null,"Medarbejderens timeforbug (timer)","Evt. deltagerbetaling (kr.)","Giver kurset ret til VEU-godtgørelse?"]
[]
[]
[]
[]
[]
[null,"Samlet antal timer (udregner selv)",null,{"$f":"SUM(D18:D22)","v":0}]
[null,"Samlet lønkompensation udover evt. VEU-godtgørelse (udregner selv)",null,{"$f":"IF(D11=\"Nej\",D23*D7,0)+IF(AND(D11=\"Ja\",F18=\"Ja\"),D18*D7,0)+IF(AND(D11=\"Ja\",F19=\"Ja\"),D19*D7,0)+IF(AND(D11=\"Ja\",F20=\"Ja\"),D20*D7,0)+IF(AND(D11=\"Ja\",F21=\"Ja\"),D21*D7,0)+IF(AND(D11=\"Ja\",F22=\"Ja\"),D22*D7,0)+IF(AND(D11=\"Ja\",F18=\"Nej\"),D18*IF(D8>261,(IF(F18=\"Ja\",260-'Format ark'!D13,260)),IF(D8<=260,IF(F18=\"Ja\",D8-'Format ark'!D13,D8))),0)+IF(AND(D11=\"Ja\",F19=\"Nej\"),D19*IF(D8>261,(IF(F19=\"Ja\",260-'Format ark'!D13,260)),IF(D8<=260,IF(F19=\"Ja\",D8-'Format ark'!D13,D8))),0)+IF(AND(D11=\"Ja\",F20=\"Nej\"),D20*IF(D8>261,(IF(F20=\"Ja\",260-'Format ark'!D13,260)),IF(D8<=260,IF(F20=\"Ja\",D8-'Format ark'!D13,D8))),0)+IF(AND(D11=\"Ja\",F21=\"Nej\"),D21*IF(D8>261,(IF(F21=\"Ja\",260-'Format ark'!D13,260)),IF(D8<=260,IF(F21=\"Ja\",D8-'Format ark'!D13,D8))),0)+IF(AND(D11=\"Ja\",F22=\"Nej\"),D22*IF(D8>261,(IF(F22=\"Ja\",260-'Format ark'!D13,260)),IF(D8<=260,IF(F22=\"Ja\",D8-'Format ark'!D13,D8))),0)","v":0}]
[null,"Estimeret VEU-godtgørelse",null,{"$f":"IF(AND(D11=\"Ja\",F18=\"Ja\"),D18*'Format ark'!D13,0)+IF(AND(D11=\"Ja\",F19=\"Ja\"),D19*'Format ark'!D13,0)+IF(AND(D11=\"Ja\",F20=\"Ja\"),D20*'Format ark'!D13,0)+IF(AND(D11=\"Ja\",F21=\"Ja\"),D21*'Format ark'!D13,0)+IF(AND(D11=\"Ja\",F22=\"Ja\"),D22*'Format ark'!D13,0)","v":0}]
[null,"Samlet deltagerbeltaing (udregner selv)",null,{"$f":"SUM(E18:E22)","v":0}]
[]
[null,"Erhversrettet efteruddannelse\nSkriv navn på efteruddannelse",null,"Medarbejderens timeforbrug (timer)","Evt. deltagerbetaling (kr.)","Giver kurset ret til VEU-godtgørelse?"]
[]
[]
[]
[]
[]
[]
[]
[]
[]
[]
[]
[]
[null,"Samlet antal timer (udregner selv)",null,{"$f":"SUM(D29:D40)","v":0}]
[null,"Samlet lønkompensation udover evt. VEU-godtgørelse (udregner selv)",null,{"$f":"IF(D11=\"Nej\",D41*D7,0)+IF(AND(D11=\"Ja\",F29=\"Ja\"),D29*D7,0)+IF(AND(D11=\"Ja\",F30=\"Ja\"),D30*D7,0)+IF(AND(D11=\"Ja\",F31=\"Ja\"),D31*D7,0)+IF(AND(D11=\"Ja\",F32=\"Ja\"),D32*D7,0)+IF(AND(D11=\"Ja\",F33=\"Ja\"),D33*D7,0)+IF(AND(D11=\"Ja\",F34=\"Ja\"),D34*D7,0)+IF(AND(D11=\"Ja\",F35=\"Ja\"),D35*D7,0)+IF(AND(D11=\"Ja\",F36=\"Ja\"),D36*D7,0)+IF(AND(D11=\"Ja\",F37=\"Ja\"),D37*D7,0)+IF(AND(D11=\"Ja\",F38=\"Ja\"),D38*D7,0)+IF(AND(D11=\"Ja\",F39=\"Ja\"),D39*D7,0)+IF(AND(D11=\"Ja\",F40=\"Ja\"),D40*D7,0)+IF(AND(D11=\"Ja\",F29=\"Nej\"),D29* IF(D8>261,(IF(F29=\"Ja\",260-'Format ark'!D13,260)),IF(D8<=260,IF(F29=\"Ja\",D8-'Format ark'!D13,D8))),0)+IF(AND(D11=\"Ja\",F30=\"Nej\"),D30* IF(D8>261,(IF(F30=\"Ja\",260-'Format ark'!D13,260)),IF(D8<=260,IF(F30=\"Ja\",D8-'Format ark'!D13,D8))),0)+IF(AND(D11=\"Ja\",F31=\"Nej\"),D31* IF(D8>261,(IF(F31=\"Ja\",260-'Format ark'!D13,260)),IF(D8<=260,IF(F31=\"Ja\",D8-'Format ark'!D13,D8))),0)+IF(AND(D11=\"Ja\",F32=\"Nej\"),D32* IF(D8>261,(IF(F32=\"Ja\",260-'Format ark'!D13,260)),IF(D8<=260,IF(F32=\"Ja\",D8-'Format ark'!D13,D8))),0)+IF(AND(D11=\"Ja\",F33=\"Nej\"),D33* IF(D8>261,(IF(F33=\"Ja\",260-'Format ark'!D13,260)),IF(D8<=260,IF(F33=\"Ja\",D8-'Format ark'!D13,D8))),0)+IF(AND(D11=\"Ja\",F34=\"Nej\"),D34* IF(D8>261,(IF(F34=\"Ja\",260-'Format ark'!D13,260)),IF(D8<=260,IF(F34=\"Ja\",D8-'Format ark'!D13,D8))),0)+IF(AND(D11=\"Ja\",F35=\"Nej\"),D35* IF(D8>261,(IF(F35=\"Ja\",260-'Format ark'!D13,260)),IF(D8<=260,IF(F35=\"Ja\",D8-'Format ark'!D13,D8))),0)+IF(AND(D11=\"Ja\",F36=\"Nej\"),D36* IF(D8>261,(IF(F36=\"Ja\",260-'Format ark'!D13,260)),IF(D8<=260,IF(F36=\"Ja\",D8-'Format ark'!D13,D8))),0)+IF(AND(D11=\"Ja\",F37=\"Nej\"),D37* IF(D8>261,(IF(F37=\"Ja\",260-'Format ark'!D13,260)),IF(D8<=260,IF(F37=\"Ja\",D8-'Format ark'!D13,D8))),0)+IF(AND(D11=\"Ja\",F38=\"Nej\"),D38* IF(D8>261,(IF(F38=\"Ja\",260-'Format ark'!D13,260)),IF(D8<=260,IF(F38=\"Ja\",D8-'Format ark'!D13,D8))),0)+IF(AND(D11=\"Ja\",F39=\"Nej\"),D39* IF(D8>261,(IF(F39=\"Ja\",260-'Format ark'!D13,260)),IF(D8<=260,IF(F39=\"Ja\",D8-'Format ark'!D13,D8))),0)+IF(AND(D11=\"Ja\",F40=\"Nej\"),D40* IF(D8>261,(IF(F40=\"Ja\",260-'Format ark'!D13,260)),IF(D8<=260,IF(F40=\"Ja\",D8-'Format ark'!D13,D8))),0)","v":0}]
[null,"Estimeret VEU-godtgørelse",null,{"$f":"IF(AND(D11=\"Ja\",F29=\"Ja\"),D29*'Format ark'!D13,0)+IF(AND(D11=\"Ja\",F30=\"Ja\"),D30*'Format ark'!D13,0)+IF(AND(D11=\"Ja\",F31=\"Ja\"),D31*'Format ark'!D13,0)+IF(AND(D11=\"Ja\",F32=\"Ja\"),D32*('Format ark'!D13),0)+IF(AND(D11=\"Ja\",F33=\"Ja\"),D33*'Format ark'!D13,0)+IF(AND(D11=\"Ja\",F34=\"Ja\"),D34*'Format ark'!D13,0)+IF(AND(D11=\"Ja\",F35=\"Ja\"),D35*'Format ark'!D13,0)+IF(AND(D11=\"Ja\",F36=\"Ja\"),D36*'Format ark'!D13,0)+IF(AND(D11=\"Ja\",F37=\"Ja\"),D37*'Format ark'!D13,0)+IF(AND(D11=\"Ja\",F38=\"Ja\"),D38*'Format ark'!D13,0)+IF(AND(D11=\"Ja\",F39=\"Ja\"),D39*'Format ark'!D13,0)+IF(AND(D11=\"Ja\",F40=\"Ja\"),D40*'Format ark'!D13,0)","v":0}]
[null,"Samlet deltagerbetaling (udregner selv)",null,{"$f":"SUM(E29:E40)","v":0}]
[]
[null,"Praktik"]
[null,"Navn på virksomhed og p-nummer"]
[null,"Medarbejderens timeforbrug",null,null,{"$f":"IF(D48>C51*0.5,\"Praktik må maksimalt udgøre 50% af det samlede tidsforbrug.\",\" \")","v":" "}]
[null,"Samlet lønkompensation for praktikopholdet",null,{"$f":"IF(D48>C51*0.5,\"IKKE MULIGT\",D48*(IF(D8>261,260,D8)))","v":0}]
[]
[null,"Samlet tidsforbrug ",{"$f":"IF(D48+D41+D23>300,\"IKKE MULIGT\",D48+D41+D23)","v":0},{"$f":"IF(C51>300,\"Det maksimale tidsforbrug er 300 timer\",\" \")","v":" "}]
[]
[null,"Tidsforbrug til administration","Antal timer","Beløb"]
[null,"Der kan godtgøres op til 5 timer.",null,{"$f":"IF(C54>5,\"Der kan maksimalt godtgøres 5 timer pr. medarbejder.\",C54*260)","v":0}]
[]
[null,"Samlet tilsagnsramme i kr. (maksimal støtte til sporskiftepakken): ",null,{"$f":"IF(AND(C51>300,D49+D44+D42+D26+D24+D54<D63+1),0,MIN(D49+D44+D42+D26+D24+D54,120000))","v":{"$error":"#REF!"}},{"$f":"IF(D56=120000,\"Det maksimale tilsagn pr. sporskiftepakke er nået, og det overstigende beløb er derfor selvbetaling.\",\"\")","v":{"$error":"#REF!"}}]
[]
[]
[null,"Estimeret VEU-godtgørelse",null,{"$f":"D43+D25","v":0}]
[]
[null,"Selvbetaling i kr. (udgifter udover den øvre tilsagnsramme)",null,{"$f":"IF(C51>300,0,MAX(D49+D54+D44+D42+D24+D26-D56,0))","v":{"$error":"#REF!"}}]
[]
[null,"Tilsagnsbeløb i kr.",null,{"$f":"Slutregnskab!J10","v":{"$error":"#REF!"}}]

{"sheet":"Medarbejder 12","index":13,"n_rows":63,"n_cols":6,"rows_kept":63,"cut":false,"hidden":true,"merged":[[62,1,62,2],[60,1,60,2],[16,1,16,2],[33,1,33,2],[58,1,58,2],[46,1,46,2],[34,1,34,2],[22,1,22,2],[23,1,23,2],[24,1,24,2],[25,1,25,2],[27,1,27,2],[28,1,28,2],[29,1,29,2],[30,1,30,2],[31,1,31,2],[8,4,8,5],[21,1,21,2],[9,1,9,2],[9,4,9,5],[10,1,10,2],[11,1,11,3],[12,1,12,3],[14,1,14,3],[17,1,17,2],[18,1,18,2],[19,1,19,2],[20,1,20,2],[1,1,1,3],[3,1,3,3],[5,1,5,2],[6,1,6,2],[8,1,8,2],[7,1,7,2],[32,1,32,2],[48,1,48,2],[55,1,56,2],[55,3,56,3],[47,1,47,2],[35,1,35,2],[36,1,36,2],[37,1,37,2],[38,1,38,2],[39,1,39,2],[40,1,40,2],[41,1,41,2],[42,1,42,2],[43,1,43,2],[45,1,45,2]]}
[]
[null,"Slutregnskab for sporskiftepakken"]
[]
[null,"Oplysninger om medarbejderen"]
[]
[null,"Medarbejderens navn"]
[null,"Medarbejderens lønkompensation fra sporskifte (kr./t.)",null,{"$f":"IF(D8>261,(IF(D11=\"Ja\",260-'Format ark'!D13,260)),IF(D8<=260,IF(D11=\"Ja\",IF(D8<'Format ark'!D13,0,D8-'Format ark'!D13),D8)))","v":0}]
[null,"Medarbejderens timesats (kr./t.)"]
[null,"Medarbejderens højst gennemførte uddannelse",null,null,{"$f":"IF(D9=\"\",\"Husk at vælge medarbejderens højst gennemførte uddannelse.\",\" \")","v":"Husk at vælge medarbejderens højst gennemførte uddannelse."}]
[null,"Har medarbejderen brugt sin uddannelse de senest 5 år?",null,null,{"$f":"IF(D10=\"\",\"Husk at svare på spørgsmålet.\",\" \")","v":"Husk at svare på spørgsmålet."}]
[null,"Medarbejder formodes at være berettiget til at få VEU-godtgørelse ",null,{"$f":"IF(OR(D9=\"Videregående uddannelse\",D9=\"Gymnasial uddannelse\")*AND(D10=\"ja\"),\"Nej\",\"Ja\")","v":"Ja"}]
[null,"Beskriv herunder hvad formålet med den planlagte sporskiftepakke er for medarbejderen:"]
[]
[]
[null,"Aktiviteter"]
[]
[null,"Afklaring, vejledning mv. \nSkriv navn på kursus",null,"Medarbejderens timeforbug (timer)","Evt. deltagerbetaling (kr.)","Giver kurset ret til VEU-godtgørelse?"]
[]
[]
[]
[]
[]
[null,"Samlet antal timer (udregner selv)",null,{"$f":"SUM(D18:D22)","v":0}]
[null,"Samlet lønkompensation udover evt. VEU-godtgørelse (udregner selv)",null,{"$f":"IF(D11=\"Nej\",D23*D7,0)+IF(AND(D11=\"Ja\",F18=\"Ja\"),D18*D7,0)+IF(AND(D11=\"Ja\",F19=\"Ja\"),D19*D7,0)+IF(AND(D11=\"Ja\",F20=\"Ja\"),D20*D7,0)+IF(AND(D11=\"Ja\",F21=\"Ja\"),D21*D7,0)+IF(AND(D11=\"Ja\",F22=\"Ja\"),D22*D7,0)+IF(AND(D11=\"Ja\",F18=\"Nej\"),D18*IF(D8>261,(IF(F18=\"Ja\",260-'Format ark'!D13,260)),IF(D8<=260,IF(F18=\"Ja\",D8-'Format ark'!D13,D8))),0)+IF(AND(D11=\"Ja\",F19=\"Nej\"),D19*IF(D8>261,(IF(F19=\"Ja\",260-'Format ark'!D13,260)),IF(D8<=260,IF(F19=\"Ja\",D8-'Format ark'!D13,D8))),0)+IF(AND(D11=\"Ja\",F20=\"Nej\"),D20*IF(D8>261,(IF(F20=\"Ja\",260-'Format ark'!D13,260)),IF(D8<=260,IF(F20=\"Ja\",D8-'Format ark'!D13,D8))),0)+IF(AND(D11=\"Ja\",F21=\"Nej\"),D21*IF(D8>261,(IF(F21=\"Ja\",260-'Format ark'!D13,260)),IF(D8<=260,IF(F21=\"Ja\",D8-'Format ark'!D13,D8))),0)+IF(AND(D11=\"Ja\",F22=\"Nej\"),D22*IF(D8>261,(IF(F22=\"Ja\",260-'Format ark'!D13,260)),IF(D8<=260,IF(F22=\"Ja\",D8-'Format ark'!D13,D8))),0)","v":0}]
[null,"Estimeret VEU-godtgørelse",null,{"$f":"IF(AND(D11=\"Ja\",F18=\"Ja\"),D18*'Format ark'!D13,0)+IF(AND(D11=\"Ja\",F19=\"Ja\"),D19*'Format ark'!D13,0)+IF(AND(D11=\"Ja\",F20=\"Ja\"),D20*'Format ark'!D13,0)+IF(AND(D11=\"Ja\",F21=\"Ja\"),D21*'Format ark'!D13,0)+IF(AND(D11=\"Ja\",F22=\"Ja\"),D22*'Format ark'!D13,0)","v":0}]
[null,"Samlet deltagerbeltaing (udregner selv)",null,{"$f":"SUM(E18:E22)","v":0}]
[]
[null,"Erhversrettet efteruddannelse\nSkriv navn på efteruddannelse",null,"Medarbejderens timeforbrug (timer)","Evt. deltagerbetaling (kr.)","Giver kurset ret til VEU-godtgørelse?"]
[]
[]
[]
[]
[]
[]
[]
[]
[]
[]
[]
[]
[null,"Samlet antal timer (udregner selv)",null,{"$f":"SUM(D29:D40)","v":0}]
[null,"Samlet lønkompensation udover evt. VEU-godtgørelse (udregner selv)",null,{"$f":"IF(D11=\"Nej\",D41*D7,0)+IF(AND(D11=\"Ja\",F29=\"Ja\"),D29*D7,0)+IF(AND(D11=\"Ja\",F30=\"Ja\"),D30*D7,0)+IF(AND(D11=\"Ja\",F31=\"Ja\"),D31*D7,0)+IF(AND(D11=\"Ja\",F32=\"Ja\"),D32*D7,0)+IF(AND(D11=\"Ja\",F33=\"Ja\"),D33*D7,0)+IF(AND(D11=\"Ja\",F34=\"Ja\"),D34*D7,0)+IF(AND(D11=\"Ja\",F35=\"Ja\"),D35*D7,0)+IF(AND(D11=\"Ja\",F36=\"Ja\"),D36*D7,0)+IF(AND(D11=\"Ja\",F37=\"Ja\"),D37*D7,0)+IF(AND(D11=\"Ja\",F38=\"Ja\"),D38*D7,0)+IF(AND(D11=\"Ja\",F39=\"Ja\"),D39*D7,0)+IF(AND(D11=\"Ja\",F40=\"Ja\"),D40*D7,0)+IF(AND(D11=\"Ja\",F29=\"Nej\"),D29* IF(D8>261,(IF(F29=\"Ja\",260-'Format ark'!D13,260)),IF(D8<=260,IF(F29=\"Ja\",D8-'Format ark'!D13,D8))),0)+IF(AND(D11=\"Ja\",F30=\"Nej\"),D30* IF(D8>261,(IF(F30=\"Ja\",260-'Format ark'!D13,260)),IF(D8<=260,IF(F30=\"Ja\",D8-'Format ark'!D13,D8))),0)+IF(AND(D11=\"Ja\",F31=\"Nej\"),D31* IF(D8>261,(IF(F31=\"Ja\",260-'Format ark'!D13,260)),IF(D8<=260,IF(F31=\"Ja\",D8-'Format ark'!D13,D8))),0)+IF(AND(D11=\"Ja\",F32=\"Nej\"),D32* IF(D8>261,(IF(F32=\"Ja\",260-'Format ark'!D13,260)),IF(D8<=260,IF(F32=\"Ja\",D8-'Format ark'!D13,D8))),0)+IF(AND(D11=\"Ja\",F33=\"Nej\"),D33* IF(D8>261,(IF(F33=\"Ja\",260-'Format ark'!D13,260)),IF(D8<=260,IF(F33=\"Ja\",D8-'Format ark'!D13,D8))),0)+IF(AND(D11=\"Ja\",F34=\"Nej\"),D34* IF(D8>261,(IF(F34=\"Ja\",260-'Format ark'!D13,260)),IF(D8<=260,IF(F34=\"Ja\",D8-'Format ark'!D13,D8))),0)+IF(AND(D11=\"Ja\",F35=\"Nej\"),D35* IF(D8>261,(IF(F35=\"Ja\",260-'Format ark'!D13,260)),IF(D8<=260,IF(F35=\"Ja\",D8-'Format ark'!D13,D8))),0)+IF(AND(D11=\"Ja\",F36=\"Nej\"),D36* IF(D8>261,(IF(F36=\"Ja\",260-'Format ark'!D13,260)),IF(D8<=260,IF(F36=\"Ja\",D8-'Format ark'!D13,D8))),0)+IF(AND(D11=\"Ja\",F37=\"Nej\"),D37* IF(D8>261,(IF(F37=\"Ja\",260-'Format ark'!D13,260)),IF(D8<=260,IF(F37=\"Ja\",D8-'Format ark'!D13,D8))),0)+IF(AND(D11=\"Ja\",F38=\"Nej\"),D38* IF(D8>261,(IF(F38=\"Ja\",260-'Format ark'!D13,260)),IF(D8<=260,IF(F38=\"Ja\",D8-'Format ark'!D13,D8))),0)+IF(AND(D11=\"Ja\",F39=\"Nej\"),D39* IF(D8>261,(IF(F39=\"Ja\",260-'Format ark'!D13,260)),IF(D8<=260,IF(F39=\"Ja\",D8-'Format ark'!D13,D8))),0)+IF(AND(D11=\"Ja\",F40=\"Nej\"),D40* IF(D8>261,(IF(F40=\"Ja\",260-'Format ark'!D13,260)),IF(D8<=260,IF(F40=\"Ja\",D8-'Format ark'!D13,D8))),0)","v":0}]
[null,"Estimeret VEU-godtgørelse",null,{"$f":"IF(AND(D11=\"Ja\",F29=\"Ja\"),D29*'Format ark'!D13,0)+IF(AND(D11=\"Ja\",F30=\"Ja\"),D30*'Format ark'!D13,0)+IF(AND(D11=\"Ja\",F31=\"Ja\"),D31*'Format ark'!D13,0)+IF(AND(D11=\"Ja\",F32=\"Ja\"),D32*('Format ark'!D13),0)+IF(AND(D11=\"Ja\",F33=\"Ja\"),D33*'Format ark'!D13,0)+IF(AND(D11=\"Ja\",F34=\"Ja\"),D34*'Format ark'!D13,0)+IF(AND(D11=\"Ja\",F35=\"Ja\"),D35*'Format ark'!D13,0)+IF(AND(D11=\"Ja\",F36=\"Ja\"),D36*'Format ark'!D13,0)+IF(AND(D11=\"Ja\",F37=\"Ja\"),D37*'Format ark'!D13,0)+IF(AND(D11=\"Ja\",F38=\"Ja\"),D38*'Format ark'!D13,0)+IF(AND(D11=\"Ja\",F39=\"Ja\"),D39*'Format ark'!D13,0)+IF(AND(D11=\"Ja\",F40=\"Ja\"),D40*'Format ark'!D13,0)","v":0}]
[null,"Samlet deltagerbetaling (udregner selv)",null,{"$f":"SUM(E29:E40)","v":0}]
[]
[null,"Praktik"]
[null,"Navn på virksomhed og p-nummer"]
[null,"Medarbejderens timeforbrug",null,null,{"$f":"IF(D48>C51*0.5,\"Praktik må maksimalt udgøre 50% af det samlede tidsforbrug.\",\" \")","v":" "}]
[null,"Samlet lønkompensation for praktikopholdet",null,{"$f":"IF(D48>C51*0.5,\"IKKE MULIGT\",D48*(IF(D8>261,260,D8)))","v":0}]
[]
[null,"Samlet tidsforbrug ",{"$f":"IF(D48+D41+D23>300,\"IKKE MULIGT\",D48+D41+D23)","v":0},{"$f":"IF(C51>300,\"Det maksimale tidsforbrug er 300 timer\",\" \")","v":" "}]
[]
[null,"Tidsforbrug til administration","Antal timer","Beløb"]
[null,"Der kan godtgøres op til 5 timer.",null,{"$f":"IF(C54>5,\"Der kan maksimalt godtgøres 5 timer pr. medarbejder.\",C54*260)","v":0}]
[]
[null,"Samlet tilsagnsramme i kr. (maksimal støtte til sporskiftepakken): ",null,{"$f":"IF(AND(C51>300,D49+D44+D42+D26+D24+D54<D63+1),0,MIN(D49+D44+D42+D26+D24+D54,120000))","v":{"$error":"#REF!"}},{"$f":"IF(D56=120000,\"Det maksimale tilsagn pr. sporskiftepakke er nået, og det overstigende beløb er derfor selvbetaling.\",\"\")","v":{"$error":"#REF!"}}]
[]
[]
[null,"Estimeret VEU-godtgørelse",null,{"$f":"D43+D25","v":0}]
[]
[null,"Selvbetaling i kr. (udgifter udover den øvre tilsagnsramme)",null,{"$f":"IF(C51>300,0,MAX(D49+D54+D44+D42+D24+D26-D56,0))","v":{"$error":"#REF!"}}]
[]
[null,"Tilsagnsbeløb i kr.",null,{"$f":"Slutregnskab!J10","v":{"$error":"#REF!"}}]

{"sheet":"Medarbejder 13","index":14,"n_rows":63,"n_cols":6,"rows_kept":63,"cut":false,"hidden":true,"merged":[[62,1,62,2],[60,1,60,2],[16,1,16,2],[33,1,33,2],[58,1,58,2],[46,1,46,2],[34,1,34,2],[22,1,22,2],[23,1,23,2],[24,1,24,2],[25,1,25,2],[27,1,27,2],[28,1,28,2],[29,1,29,2],[30,1,30,2],[31,1,31,2],[8,4,8,5],[21,1,21,2],[9,1,9,2],[9,4,9,5],[10,1,10,2],[11,1,11,3],[12,1,12,3],[14,1,14,3],[17,1,17,2],[18,1,18,2],[19,1,19,2],[20,1,20,2],[1,1,1,3],[3,1,3,3],[5,1,5,2],[6,1,6,2],[8,1,8,2],[7,1,7,2],[32,1,32,2],[48,1,48,2],[55,1,56,2],[55,3,56,3],[47,1,47,2],[35,1,35,2],[36,1,36,2],[37,1,37,2],[38,1,38,2],[39,1,39,2],[40,1,40,2],[41,1,41,2],[42,1,42,2],[43,1,43,2],[45,1,45,2]]}
[]
[null,"Slutregnskab for sporskiftepakken"]
[]
[null,"Oplysninger om medarbejderen"]
[]
[null,"Medarbejderens navn"]
[null,"Medarbejderens lønkompensation fra sporskifte (kr./t.)",null,{"$f":"IF(D8>261,(IF(D11=\"Ja\",260-'Format ark'!D13,260)),IF(D8<=260,IF(D11=\"Ja\",IF(D8<'Format ark'!D13,0,D8-'Format ark'!D13),D8)))","v":0}]
[null,"Medarbejderens timesats (kr./t.)"]
[null,"Medarbejderens højst gennemførte uddannelse",null,null,{"$f":"IF(D9=\"\",\"Husk at vælge medarbejderens højst gennemførte uddannelse.\",\" \")","v":"Husk at vælge medarbejderens højst gennemførte uddannelse."}]
[null,"Har medarbejderen brugt sin uddannelse de senest 5 år?",null,null,{"$f":"IF(D10=\"\",\"Husk at svare på spørgsmålet.\",\" \")","v":"Husk at svare på spørgsmålet."}]
[null,"Medarbejder formodes at være berettiget til at få VEU-godtgørelse ",null,{"$f":"IF(OR(D9=\"Videregående uddannelse\",D9=\"Gymnasial uddannelse\")*AND(D10=\"ja\"),\"Nej\",\"Ja\")","v":"Ja"}]
[null,"Beskriv herunder hvad formålet med den planlagte sporskiftepakke er for medarbejderen:"]
[]
[]
[null,"Aktiviteter"]
[]
[null,"Afklaring, vejledning mv. \nSkriv navn på kursus",null,"Medarbejderens timeforbug (timer)","Evt. deltagerbetaling (kr.)","Giver kurset ret til VEU-godtgørelse?"]
[]
[]
[]
[]
[]
[null,"Samlet antal timer (udregner selv)",null,{"$f":"SUM(D18:D22)","v":0}]
[null,"Samlet lønkompensation udover evt. VEU-godtgørelse (udregner selv)",null,{"$f":"IF(D11=\"Nej\",D23*D7,0)+IF(AND(D11=\"Ja\",F18=\"Ja\"),D18*D7,0)+IF(AND(D11=\"Ja\",F19=\"Ja\"),D19*D7,0)+IF(AND(D11=\"Ja\",F20=\"Ja\"),D20*D7,0)+IF(AND(D11=\"Ja\",F21=\"Ja\"),D21*D7,0)+IF(AND(D11=\"Ja\",F22=\"Ja\"),D22*D7,0)+IF(AND(D11=\"Ja\",F18=\"Nej\"),D18*IF(D8>261,(IF(F18=\"Ja\",260-'Format ark'!D13,260)),IF(D8<=260,IF(F18=\"Ja\",D8-'Format ark'!D13,D8))),0)+IF(AND(D11=\"Ja\",F19=\"Nej\"),D19*IF(D8>261,(IF(F19=\"Ja\",260-'Format ark'!D13,260)),IF(D8<=260,IF(F19=\"Ja\",D8-'Format ark'!D13,D8))),0)+IF(AND(D11=\"Ja\",F20=\"Nej\"),D20*IF(D8>261,(IF(F20=\"Ja\",260-'Format ark'!D13,260)),IF(D8<=260,IF(F20=\"Ja\",D8-'Format ark'!D13,D8))),0)+IF(AND(D11=\"Ja\",F21=\"Nej\"),D21*IF(D8>261,(IF(F21=\"Ja\",260-'Format ark'!D13,260)),IF(D8<=260,IF(F21=\"Ja\",D8-'Format ark'!D13,D8))),0)+IF(AND(D11=\"Ja\",F22=\"Nej\"),D22*IF(D8>261,(IF(F22=\"Ja\",260-'Format ark'!D13,260)),IF(D8<=260,IF(F22=\"Ja\",D8-'Format ark'!D13,D8))),0)","v":0}]
[null,"Estimeret VEU-godtgørelse",null,{"$f":"IF(AND(D11=\"Ja\",F18=\"Ja\"),D18*'Format ark'!D13,0)+IF(AND(D11=\"Ja\",F19=\"Ja\"),D19*'Format ark'!D13,0)+IF(AND(D11=\"Ja\",F20=\"Ja\"),D20*'Format ark'!D13,0)+IF(AND(D11=\"Ja\",F21=\"Ja\"),D21*'Format ark'!D13,0)+IF(AND(D11=\"Ja\",F22=\"Ja\"),D22*'Format ark'!D13,0)","v":0}]
[null,"Samlet deltagerbeltaing (udregner selv)",null,{"$f":"SUM(E18:E22)","v":0}]
[]
[null,"Erhversrettet efteruddannelse\nSkriv navn på efteruddannelse",null,"Medarbejderens timeforbrug (timer)","Evt. deltagerbetaling (kr.)","Giver kurset ret til VEU-godtgørelse?"]
[]
[]
[]
[]
[]
[]
[]
[]
[]
[]
[]
[]
[null,"Samlet antal timer (udregner selv)",null,{"$f":"SUM(D29:D40)","v":0}]
[null,"Samlet lønkompensation udover evt. VEU-godtgørelse (udregner selv)",null,{"$f":"IF(D11=\"Nej\",D41*D7,0)+IF(AND(D11=\"Ja\",F29=\"Ja\"),D29*D7,0)+IF(AND(D11=\"Ja\",F30=\"Ja\"),D30*D7,0)+IF(AND(D11=\"Ja\",F31=\"Ja\"),D31*D7,0)+IF(AND(D11=\"Ja\",F32=\"Ja\"),D32*D7,0)+IF(AND(D11=\"Ja\",F33=\"Ja\"),D33*D7,0)+IF(AND(D11=\"Ja\",F34=\"Ja\"),D34*D7,0)+IF(AND(D11=\"Ja\",F35=\"Ja\"),D35*D7,0)+IF(AND(D11=\"Ja\",F36=\"Ja\"),D36*D7,0)+IF(AND(D11=\"Ja\",F37=\"Ja\"),D37*D7,0)+IF(AND(D11=\"Ja\",F38=\"Ja\"),D38*D7,0)+IF(AND(D11=\"Ja\",F39=\"Ja\"),D39*D7,0)+IF(AND(D11=\"Ja\",F40=\"Ja\"),D40*D7,0)+IF(AND(D11=\"Ja\",F29=\"Nej\"),D29* IF(D8>261,(IF(F29=\"Ja\",260-'Format ark'!D13,260)),IF(D8<=260,IF(F29=\"Ja\",D8-'Format ark'!D13,D8))),0)+IF(AND(D11=\"Ja\",F30=\"Nej\"),D30* IF(D8>261,(IF(F30=\"Ja\",260-'Format ark'!D13,260)),IF(D8<=260,IF(F30=\"Ja\",D8-'Format ark'!D13,D8))),0)+IF(AND(D11=\"Ja\",F31=\"Nej\"),D31* IF(D8>261,(IF(F31=\"Ja\",260-'Format ark'!D13,260)),IF(D8<=260,IF(F31=\"Ja\",D8-'Format ark'!D13,D8))),0)+IF(AND(D11=\"Ja\",F32=\"Nej\"),D32* IF(D8>261,(IF(F32=\"Ja\",260-'Format ark'!D13,260)),IF(D8<=260,IF(F32=\"Ja\",D8-'Format ark'!D13,D8))),0)+IF(AND(D11=\"Ja\",F33=\"Nej\"),D33* IF(D8>261,(IF(F33=\"Ja\",260-'Format ark'!D13,260)),IF(D8<=260,IF(F33=\"Ja\",D8-'Format ark'!D13,D8))),0)+IF(AND(D11=\"Ja\",F34=\"Nej\"),D34* IF(D8>261,(IF(F34=\"Ja\",260-'Format ark'!D13,260)),IF(D8<=260,IF(F34=\"Ja\",D8-'Format ark'!D13,D8))),0)+IF(AND(D11=\"Ja\",F35=\"Nej\"),D35* IF(D8>261,(IF(F35=\"Ja\",260-'Format ark'!D13,260)),IF(D8<=260,IF(F35=\"Ja\",D8-'Format ark'!D13,D8))),0)+IF(AND(D11=\"Ja\",F36=\"Nej\"),D36* IF(D8>261,(IF(F36=\"Ja\",260-'Format ark'!D13,260)),IF(D8<=260,IF(F36=\"Ja\",D8-'Format ark'!D13,D8))),0)+IF(AND(D11=\"Ja\",F37=\"Nej\"),D37* IF(D8>261,(IF(F37=\"Ja\",260-'Format ark'!D13,260)),IF(D8<=260,IF(F37=\"Ja\",D8-'Format ark'!D13,D8))),0)+IF(AND(D11=\"Ja\",F38=\"Nej\"),D38* IF(D8>261,(IF(F38=\"Ja\",260-'Format ark'!D13,260)),IF(D8<=260,IF(F38=\"Ja\",D8-'Format ark'!D13,D8))),0)+IF(AND(D11=\"Ja\",F39=\"Nej\"),D39* IF(D8>261,(IF(F39=\"Ja\",260-'Format ark'!D13,260)),IF(D8<=260,IF(F39=\"Ja\",D8-'Format ark'!D13,D8))),0)+IF(AND(D11=\"Ja\",F40=\"Nej\"),D40* IF(D8>261,(IF(F40=\"Ja\",260-'Format ark'!D13,260)),IF(D8<=260,IF(F40=\"Ja\",D8-'Format ark'!D13,D8))),0)","v":0}]
[null,"Estimeret VEU-godtgørelse",null,{"$f":"IF(AND(D11=\"Ja\",F29=\"Ja\"),D29*'Format ark'!D13,0)+IF(AND(D11=\"Ja\",F30=\"Ja\"),D30*'Format ark'!D13,0)+IF(AND(D11=\"Ja\",F31=\"Ja\"),D31*'Format ark'!D13,0)+IF(AND(D11=\"Ja\",F32=\"Ja\"),D32*('Format ark'!D13),0)+IF(AND(D11=\"Ja\",F33=\"Ja\"),D33*'Format ark'!D13,0)+IF(AND(D11=\"Ja\",F34=\"Ja\"),D34*'Format ark'!D13,0)+IF(AND(D11=\"Ja\",F35=\"Ja\"),D35*'Format ark'!D13,0)+IF(AND(D11=\"Ja\",F36=\"Ja\"),D36*'Format ark'!D13,0)+IF(AND(D11=\"Ja\",F37=\"Ja\"),D37*'Format ark'!D13,0)+IF(AND(D11=\"Ja\",F38=\"Ja\"),D38*'Format ark'!D13,0)+IF(AND(D11=\"Ja\",F39=\"Ja\"),D39*'Format ark'!D13,0)+IF(AND(D11=\"Ja\",F40=\"Ja\"),D40*'Format ark'!D13,0)","v":0}]
[null,"Samlet deltagerbetaling (udregner selv)",null,{"$f":"SUM(E29:E40)","v":0}]
[]
[null,"Praktik"]
[null,"Navn på virksomhed og p-nummer"]
[null,"Medarbejderens timeforbrug",null,null,{"$f":"IF(D48>C51*0.5,\"Praktik må maksimalt udgøre 50% af det samlede tidsforbrug.\",\" \")","v":" "}]
[null,"Samlet lønkompensation for praktikopholdet",null,{"$f":"IF(D48>C51*0.5,\"IKKE MULIGT\",D48*(IF(D8>261,260,D8)))","v":0}]
[]
[null,"Samlet tidsforbrug ",{"$f":"IF(D48+D41+D23>300,\"IKKE MULIGT\",D48+D41+D23)","v":0},{"$f":"IF(C51>300,\"Det maksimale tidsforbrug er 300 timer\",\" \")","v":" "}]
[]
[null,"Tidsforbrug til administration","Antal timer","Beløb"]
[null,"Der kan godtgøres op til 5 timer.",null,{"$f":"IF(C54>5,\"Der kan maksimalt godtgøres 5 timer pr. medarbejder.\",C54*260)","v":0}]
[]
[null,"Samlet tilsagnsramme i kr. (maksimal støtte til sporskiftepakken): ",null,{"$f":"IF(AND(C51>300,D49+D44+D42+D26+D24+D54<D63+1),0,MIN(D49+D44+D42+D26+D24+D54,120000))","v":{"$error":"#REF!"}},{"$f":"IF(D56=120000,\"Det maksimale tilsagn pr. sporskiftepakke er nået, og det overstigende beløb er derfor selvbetaling.\",\"\")","v":{"$error":"#REF!"}}]
[]
[]
[null,"Estimeret VEU-godtgørelse",null,{"$f":"D43+D25","v":0}]
[]
[null,"Selvbetaling i kr. (udgifter udover den øvre tilsagnsramme)",null,{"$f":"IF(C51>300,0,MAX(D49+D54+D44+D42+D24+D26-D56,0))","v":{"$error":"#REF!"}}]
[]
[null,"Tilsagnsbeløb i kr.",null,{"$f":"Slutregnskab!J10","v":{"$error":"#REF!"}}]

{"sheet":"Medarbejder 14","index":15,"n_rows":63,"n_cols":6,"rows_kept":63,"cut":false,"hidden":true,"merged":[[62,1,62,2],[60,1,60,2],[16,1,16,2],[33,1,33,2],[58,1,58,2],[46,1,46,2],[34,1,34,2],[22,1,22,2],[23,1,23,2],[24,1,24,2],[25,1,25,2],[27,1,27,2],[28,1,28,2],[29,1,29,2],[30,1,30,2],[31,1,31,2],[8,4,8,5],[21,1,21,2],[9,1,9,2],[9,4,9,5],[10,1,10,2],[11,1,11,3],[12,1,12,3],[14,1,14,3],[17,1,17,2],[18,1,18,2],[19,1,19,2],[20,1,20,2],[1,1,1,3],[3,1,3,3],[5,1,5,2],[6,1,6,2],[8,1,8,2],[7,1,7,2],[32,1,32,2],[48,1,48,2],[55,1,56,2],[55,3,56,3],[47,1,47,2],[35,1,35,2],[36,1,36,2],[37,1,37,2],[38,1,38,2],[39,1,39,2],[40,1,40,2],[41,1,41,2],[42,1,42,2],[43,1,43,2],[45,1,45,2]]}
[]
[null,"Slutregnskab for sporskiftepakken"]
[]
[null,"Oplysninger om medarbejderen"]
[]
[null,"Medarbejderens navn"]
[null,"Medarbejderens lønkompensation fra sporskifte (kr./t.)",null,{"$f":"IF(D8>261,(IF(D11=\"Ja\",260-'Format ark'!D13,260)),IF(D8<=260,IF(D11=\"Ja\",IF(D8<'Format ark'!D13,0,D8-'Format ark'!D13),D8)))","v":0}]
[null,"Medarbejderens timesats (kr./t.)"]
[null,"Medarbejderens højst gennemførte uddannelse",null,null,{"$f":"IF(D9=\"\",\"Husk at vælge medarbejderens højst gennemførte uddannelse.\",\" \")","v":"Husk at vælge medarbejderens højst gennemførte uddannelse."}]
[null,"Har medarbejderen brugt sin uddannelse de senest 5 år?",null,null,{"$f":"IF(D10=\"\",\"Husk at svare på spørgsmålet.\",\" \")","v":"Husk at svare på spørgsmålet."}]
[null,"Medarbejder formodes at være berettiget til at få VEU-godtgørelse ",null,{"$f":"IF(OR(D9=\"Videregående uddannelse\",D9=\"Gymnasial uddannelse\")*AND(D10=\"ja\"),\"Nej\",\"Ja\")","v":"Ja"}]
[null,"Beskriv herunder hvad formålet med den planlagte sporskiftepakke er for medarbejderen:"]
[]
[]
[null,"Aktiviteter"]
[]
[null,"Afklaring, vejledning mv. \nSkriv navn på kursus",null,"Medarbejderens timeforbug (timer)","Evt. deltagerbetaling (kr.)","Giver kurset ret til VEU-godtgørelse?"]
[]
[]
[]
[]
[]
[null,"Samlet antal timer (udregner selv)",null,{"$f":"SUM(D18:D22)","v":0}]
[null,"Samlet lønkompensation udover evt. VEU-godtgørelse (udregner selv)",null,{"$f":"IF(D11=\"Nej\",D23*D7,0)+IF(AND(D11=\"Ja\",F18=\"Ja\"),D18*D7,0)+IF(AND(D11=\"Ja\",F19=\"Ja\"),D19*D7,0)+IF(AND(D11=\"Ja\",F20=\"Ja\"),D20*D7,0)+IF(AND(D11=\"Ja\",F21=\"Ja\"),D21*D7,0)+IF(AND(D11=\"Ja\",F22=\"Ja\"),D22*D7,0)+IF(AND(D11=\"Ja\",F18=\"Nej\"),D18*IF(D8>261,(IF(F18=\"Ja\",260-'Format ark'!D13,260)),IF(D8<=260,IF(F18=\"Ja\",D8-'Format ark'!D13,D8))),0)+IF(AND(D11=\"Ja\",F19=\"Nej\"),D19*IF(D8>261,(IF(F19=\"Ja\",260-'Format ark'!D13,260)),IF(D8<=260,IF(F19=\"Ja\",D8-'Format ark'!D13,D8))),0)+IF(AND(D11=\"Ja\",F20=\"Nej\"),D20*IF(D8>261,(IF(F20=\"Ja\",260-'Format ark'!D13,260)),IF(D8<=260,IF(F20=\"Ja\",D8-'Format ark'!D13,D8))),0)+IF(AND(D11=\"Ja\",F21=\"Nej\"),D21*IF(D8>261,(IF(F21=\"Ja\",260-'Format ark'!D13,260)),IF(D8<=260,IF(F21=\"Ja\",D8-'Format ark'!D13,D8))),0)+IF(AND(D11=\"Ja\",F22=\"Nej\"),D22*IF(D8>261,(IF(F22=\"Ja\",260-'Format ark'!D13,260)),IF(D8<=260,IF(F22=\"Ja\",D8-'Format ark'!D13,D8))),0)","v":0}]
[null,"Estimeret VEU-godtgørelse",null,{"$f":"IF(AND(D11=\"Ja\",F18=\"Ja\"),D18*'Format ark'!D13,0)+IF(AND(D11=\"Ja\",F19=\"Ja\"),D19*'Format ark'!D13,0)+IF(AND(D11=\"Ja\",F20=\"Ja\"),D20*'Format ark'!D13,0)+IF(AND(D11=\"Ja\",F21=\"Ja\"),D21*'Format ark'!D13,0)+IF(AND(D11=\"Ja\",F22=\"Ja\"),D22*'Format ark'!D13,0)","v":0}]
[null,"Samlet deltagerbeltaing (udregner selv)",null,{"$f":"SUM(E18:E22)","v":0}]
[]
[null,"Erhversrettet efteruddannelse\nSkriv navn på efteruddannelse",null,"Medarbejderens timeforbrug (timer)","Evt. deltagerbetaling (kr.)","Giver kurset ret til VEU-godtgørelse?"]
[]
[]
[]
[]
[]
[]
[]
[]
[]
[]
[]
[]
[null,"Samlet antal timer (udregner selv)",null,{"$f":"SUM(D29:D40)","v":0}]
[null,"Samlet lønkompensation udover evt. VEU-godtgørelse (udregner selv)",null,{"$f":"IF(D11=\"Nej\",D41*D7,0)+IF(AND(D11=\"Ja\",F29=\"Ja\"),D29*D7,0)+IF(AND(D11=\"Ja\",F30=\"Ja\"),D30*D7,0)+IF(AND(D11=\"Ja\",F31=\"Ja\"),D31*D7,0)+IF(AND(D11=\"Ja\",F32=\"Ja\"),D32*D7,0)+IF(AND(D11=\"Ja\",F33=\"Ja\"),D33*D7,0)+IF(AND(D11=\"Ja\",F34=\"Ja\"),D34*D7,0)+IF(AND(D11=\"Ja\",F35=\"Ja\"),D35*D7,0)+IF(AND(D11=\"Ja\",F36=\"Ja\"),D36*D7,0)+IF(AND(D11=\"Ja\",F37=\"Ja\"),D37*D7,0)+IF(AND(D11=\"Ja\",F38=\"Ja\"),D38*D7,0)+IF(AND(D11=\"Ja\",F39=\"Ja\"),D39*D7,0)+IF(AND(D11=\"Ja\",F40=\"Ja\"),D40*D7,0)+IF(AND(D11=\"Ja\",F29=\"Nej\"),D29* IF(D8>261,(IF(F29=\"Ja\",260-'Format ark'!D13,260)),IF(D8<=260,IF(F29=\"Ja\",D8-'Format ark'!D13,D8))),0)+IF(AND(D11=\"Ja\",F30=\"Nej\"),D30* IF(D8>261,(IF(F30=\"Ja\",260-'Format ark'!D13,260)),IF(D8<=260,IF(F30=\"Ja\",D8-'Format ark'!D13,D8))),0)+IF(AND(D11=\"Ja\",F31=\"Nej\"),D31* IF(D8>261,(IF(F31=\"Ja\",260-'Format ark'!D13,260)),IF(D8<=260,IF(F31=\"Ja\",D8-'Format ark'!D13,D8))),0)+IF(AND(D11=\"Ja\",F32=\"Nej\"),D32* IF(D8>261,(IF(F32=\"Ja\",260-'Format ark'!D13,260)),IF(D8<=260,IF(F32=\"Ja\",D8-'Format ark'!D13,D8))),0)+IF(AND(D11=\"Ja\",F33=\"Nej\"),D33* IF(D8>261,(IF(F33=\"Ja\",260-'Format ark'!D13,260)),IF(D8<=260,IF(F33=\"Ja\",D8-'Format ark'!D13,D8))),0)+IF(AND(D11=\"Ja\",F34=\"Nej\"),D34* IF(D8>261,(IF(F34=\"Ja\",260-'Format ark'!D13,260)),IF(D8<=260,IF(F34=\"Ja\",D8-'Format ark'!D13,D8))),0)+IF(AND(D11=\"Ja\",F35=\"Nej\"),D35* IF(D8>261,(IF(F35=\"Ja\",260-'Format ark'!D13,260)),IF(D8<=260,IF(F35=\"Ja\",D8-'Format ark'!D13,D8))),0)+IF(AND(D11=\"Ja\",F36=\"Nej\"),D36* IF(D8>261,(IF(F36=\"Ja\",260-'Format ark'!D13,260)),IF(D8<=260,IF(F36=\"Ja\",D8-'Format ark'!D13,D8))),0)+IF(AND(D11=\"Ja\",F37=\"Nej\"),D37* IF(D8>261,(IF(F37=\"Ja\",260-'Format ark'!D13,260)),IF(D8<=260,IF(F37=\"Ja\",D8-'Format ark'!D13,D8))),0)+IF(AND(D11=\"Ja\",F38=\"Nej\"),D38* IF(D8>261,(IF(F38=\"Ja\",260-'Format ark'!D13,260)),IF(D8<=260,IF(F38=\"Ja\",D8-'Format ark'!D13,D8))),0)+IF(AND(D11=\"Ja\",F39=\"Nej\"),D39* IF(D8>261,(IF(F39=\"Ja\",260-'Format ark'!D13,260)),IF(D8<=260,IF(F39=\"Ja\",D8-'Format ark'!D13,D8))),0)+IF(AND(D11=\"Ja\",F40=\"Nej\"),D40* IF(D8>261,(IF(F40=\"Ja\",260-'Format ark'!D13,260)),IF(D8<=260,IF(F40=\"Ja\",D8-'Format ark'!D13,D8))),0)","v":0}]
[null,"Estimeret VEU-godtgørelse",null,{"$f":"IF(AND(D11=\"Ja\",F29=\"Ja\"),D29*'Format ark'!D13,0)+IF(AND(D11=\"Ja\",F30=\"Ja\"),D30*'Format ark'!D13,0)+IF(AND(D11=\"Ja\",F31=\"Ja\"),D31*'Format ark'!D13,0)+IF(AND(D11=\"Ja\",F32=\"Ja\"),D32*('Format ark'!D13),0)+IF(AND(D11=\"Ja\",F33=\"Ja\"),D33*'Format ark'!D13,0)+IF(AND(D11=\"Ja\",F34=\"Ja\"),D34*'Format ark'!D13,0)+IF(AND(D11=\"Ja\",F35=\"Ja\"),D35*'Format ark'!D13,0)+IF(AND(D11=\"Ja\",F36=\"Ja\"),D36*'Format ark'!D13,0)+IF(AND(D11=\"Ja\",F37=\"Ja\"),D37*'Format ark'!D13,0)+IF(AND(D11=\"Ja\",F38=\"Ja\"),D38*'Format ark'!D13,0)+IF(AND(D11=\"Ja\",F39=\"Ja\"),D39*'Format ark'!D13,0)+IF(AND(D11=\"Ja\",F40=\"Ja\"),D40*'Format ark'!D13,0)","v":0}]
[null,"Samlet deltagerbetaling (udregner selv)",null,{"$f":"SUM(E29:E40)","v":0}]
[]
[null,"Praktik"]
[null,"Navn på virksomhed og p-nummer"]
[null,"Medarbejderens timeforbrug",null,null,{"$f":"IF(D48>C51*0.5,\"Praktik må maksimalt udgøre 50% af det samlede tidsforbrug.\",\" \")","v":" "}]
[null,"Samlet lønkompensation for praktikopholdet",null,{"$f":"IF(D48>C51*0.5,\"IKKE MULIGT\",D48*(IF(D8>261,260,D8)))","v":0}]
[]
[null,"Samlet tidsforbrug ",{"$f":"IF(D48+D41+D23>300,\"IKKE MULIGT\",D48+D41+D23)","v":0},{"$f":"IF(C51>300,\"Det maksimale tidsforbrug er 300 timer\",\" \")","v":" "}]
[]
[null,"Tidsforbrug til administration","Antal timer","Beløb"]
[null,"Der kan godtgøres op til 5 timer.",null,{"$f":"IF(C54>5,\"Der kan maksimalt godtgøres 5 timer pr. medarbejder.\",C54*260)","v":0}]
[]
[null,"Samlet tilsagnsramme i kr. (maksimal støtte til sporskiftepakken): ",null,{"$f":"IF(AND(C51>300,D49+D44+D42+D26+D24+D54<D63+1),0,MIN(D49+D44+D42+D26+D24+D54,120000))","v":{"$error":"#REF!"}},{"$f":"IF(D56=120000,\"Det maksimale tilsagn pr. sporskiftepakke er nået, og det overstigende beløb er derfor selvbetaling.\",\"\")","v":{"$error":"#REF!"}}]
[]
[]
[null,"Estimeret VEU-godtgørelse",null,{"$f":"D43+D25","v":0}]
[]
[null,"Selvbetaling i kr. (udgifter udover den øvre tilsagnsramme)",null,{"$f":"IF(C51>300,0,MAX(D49+D54+D44+D42+D24+D26-D56,0))","v":{"$error":"#REF!"}}]
[]
[null,"Tilsagnsbeløb i kr.",null,{"$f":"Slutregnskab!J10","v":{"$error":"#REF!"}}]

{"sheet":"Medarbejder 15","index":16,"n_rows":63,"n_cols":6,"rows_kept":63,"cut":false,"hidden":true,"merged":[[62,1,62,2],[60,1,60,2],[16,1,16,2],[33,1,33,2],[58,1,58,2],[46,1,46,2],[34,1,34,2],[22,1,22,2],[23,1,23,2],[24,1,24,2],[25,1,25,2],[27,1,27,2],[28,1,28,2],[29,1,29,2],[30,1,30,2],[31,1,31,2],[8,4,8,5],[21,1,21,2],[9,1,9,2],[9,4,9,5],[10,1,10,2],[11,1,11,3],[12,1,12,3],[14,1,14,3],[17,1,17,2],[18,1,18,2],[19,1,19,2],[20,1,20,2],[1,1,1,3],[3,1,3,3],[5,1,5,2],[6,1,6,2],[8,1,8,2],[7,1,7,2],[32,1,32,2],[48,1,48,2],[55,1,56,2],[55,3,56,3],[47,1,47,2],[35,1,35,2],[36,1,36,2],[37,1,37,2],[38,1,38,2],[39,1,39,2],[40,1,40,2],[41,1,41,2],[42,1,42,2],[43,1,43,2],[45,1,45,2]]}
[]
[null,"Slutregnskab for sporskiftepakken"]
[]
[null,"Oplysninger om medarbejderen"]
[]
[null,"Medarbejderens navn"]
[null,"Medarbejderens lønkompensation fra sporskifte (kr./t.)",null,{"$f":"IF(D8>261,(IF(D11=\"Ja\",260-'Format ark'!D13,260)),IF(D8<=260,IF(D11=\"Ja\",IF(D8<'Format ark'!D13,0,D8-'Format ark'!D13),D8)))","v":0}]
[null,"Medarbejderens timesats (kr./t.)"]
[null,"Medarbejderens højst gennemførte uddannelse",null,null,{"$f":"IF(D9=\"\",\"Husk at vælge medarbejderens højst gennemførte uddannelse.\",\" \")","v":"Husk at vælge medarbejderens højst gennemførte uddannelse."}]
[null,"Har medarbejderen brugt sin uddannelse de senest 5 år?",null,null,{"$f":"IF(D10=\"\",\"Husk at svare på spørgsmålet.\",\" \")","v":"Husk at svare på spørgsmålet."}]
[null,"Medarbejder formodes at være berettiget til at få VEU-godtgørelse ",null,{"$f":"IF(OR(D9=\"Videregående uddannelse\",D9=\"Gymnasial uddannelse\")*AND(D10=\"ja\"),\"Nej\",\"Ja\")","v":"Ja"}]
[null,"Beskriv herunder hvad formålet med den planlagte sporskiftepakke er for medarbejderen:"]
[]
[]
[null,"Aktiviteter"]
[]
[null,"Afklaring, vejledning mv. \nSkriv navn på kursus",null,"Medarbejderens timeforbug (timer)","Evt. deltagerbetaling (kr.)","Giver kurset ret til VEU-godtgørelse?"]
[]
[]
[]
[]
[]
[null,"Samlet antal timer (udregner selv)",null,{"$f":"SUM(D18:D22)","v":0}]
[null,"Samlet lønkompensation udover evt. VEU-godtgørelse (udregner selv)",null,{"$f":"IF(D11=\"Nej\",D23*D7,0)+IF(AND(D11=\"Ja\",F18=\"Ja\"),D18*D7,0)+IF(AND(D11=\"Ja\",F19=\"Ja\"),D19*D7,0)+IF(AND(D11=\"Ja\",F20=\"Ja\"),D20*D7,0)+IF(AND(D11=\"Ja\",F21=\"Ja\"),D21*D7,0)+IF(AND(D11=\"Ja\",F22=\"Ja\"),D22*D7,0)+IF(AND(D11=\"Ja\",F18=\"Nej\"),D18*IF(D8>261,(IF(F18=\"Ja\",260-'Format ark'!D13,260)),IF(D8<=260,IF(F18=\"Ja\",D8-'Format ark'!D13,D8))),0)+IF(AND(D11=\"Ja\",F19=\"Nej\"),D19*IF(D8>261,(IF(F19=\"Ja\",260-'Format ark'!D13,260)),IF(D8<=260,IF(F19=\"Ja\",D8-'Format ark'!D13,D8))),0)+IF(AND(D11=\"Ja\",F20=\"Nej\"),D20*IF(D8>261,(IF(F20=\"Ja\",260-'Format ark'!D13,260)),IF(D8<=260,IF(F20=\"Ja\",D8-'Format ark'!D13,D8))),0)+IF(AND(D11=\"Ja\",F21=\"Nej\"),D21*IF(D8>261,(IF(F21=\"Ja\",260-'Format ark'!D13,260)),IF(D8<=260,IF(F21=\"Ja\",D8-'Format ark'!D13,D8))),0)+IF(AND(D11=\"Ja\",F22=\"Nej\"),D22*IF(D8>261,(IF(F22=\"Ja\",260-'Format ark'!D13,260)),IF(D8<=260,IF(F22=\"Ja\",D8-'Format ark'!D13,D8))),0)","v":0}]
[null,"Estimeret VEU-godtgørelse",null,{"$f":"IF(AND(D11=\"Ja\",F18=\"Ja\"),D18*'Format ark'!D13,0)+IF(AND(D11=\"Ja\",F19=\"Ja\"),D19*'Format ark'!D13,0)+IF(AND(D11=\"Ja\",F20=\"Ja\"),D20*'Format ark'!D13,0)+IF(AND(D11=\"Ja\",F21=\"Ja\"),D21*'Format ark'!D13,0)+IF(AND(D11=\"Ja\",F22=\"Ja\"),D22*'Format ark'!D13,0)","v":0}]
[null,"Samlet deltagerbeltaing (udregner selv)",null,{"$f":"SUM(E18:E22)","v":0}]
[]
[null,"Erhversrettet efteruddannelse\nSkriv navn på efteruddannelse",null,"Medarbejderens timeforbrug (timer)","Evt. deltagerbetaling (kr.)","Giver kurset ret til VEU-godtgørelse?"]
[]
[]
[]
[]
[]
[]
[]
[]
[]
[]
[]
[]
[null,"Samlet antal timer (udregner selv)",null,{"$f":"SUM(D29:D40)","v":0}]
[null,"Samlet lønkompensation udover evt. VEU-godtgørelse (udregner selv)",null,{"$f":"IF(D11=\"Nej\",D41*D7,0)+IF(AND(D11=\"Ja\",F29=\"Ja\"),D29*D7,0)+IF(AND(D11=\"Ja\",F30=\"Ja\"),D30*D7,0)+IF(AND(D11=\"Ja\",F31=\"Ja\"),D31*D7,0)+IF(AND(D11=\"Ja\",F32=\"Ja\"),D32*D7,0)+IF(AND(D11=\"Ja\",F33=\"Ja\"),D33*D7,0)+IF(AND(D11=\"Ja\",F34=\"Ja\"),D34*D7,0)+IF(AND(D11=\"Ja\",F35=\"Ja\"),D35*D7,0)+IF(AND(D11=\"Ja\",F36=\"Ja\"),D36*D7,0)+IF(AND(D11=\"Ja\",F37=\"Ja\"),D37*D7,0)+IF(AND(D11=\"Ja\",F38=\"Ja\"),D38*D7,0)+IF(AND(D11=\"Ja\",F39=\"Ja\"),D39*D7,0)+IF(AND(D11=\"Ja\",F40=\"Ja\"),D40*D7,0)+IF(AND(D11=\"Ja\",F29=\"Nej\"),D29* IF(D8>261,(IF(F29=\"Ja\",260-'Format ark'!D13,260)),IF(D8<=260,IF(F29=\"Ja\",D8-'Format ark'!D13,D8))),0)+IF(AND(D11=\"Ja\",F30=\"Nej\"),D30* IF(D8>261,(IF(F30=\"Ja\",260-'Format ark'!D13,260)),IF(D8<=260,IF(F30=\"Ja\",D8-'Format ark'!D13,D8))),0)+IF(AND(D11=\"Ja\",F31=\"Nej\"),D31* IF(D8>261,(IF(F31=\"Ja\",260-'Format ark'!D13,260)),IF(D8<=260,IF(F31=\"Ja\",D8-'Format ark'!D13,D8))),0)+IF(AND(D11=\"Ja\",F32=\"Nej\"),D32* IF(D8>261,(IF(F32=\"Ja\",260-'Format ark'!D13,260)),IF(D8<=260,IF(F32=\"Ja\",D8-'Format ark'!D13,D8))),0)+IF(AND(D11=\"Ja\",F33=\"Nej\"),D33* IF(D8>261,(IF(F33=\"Ja\",260-'Format ark'!D13,260)),IF(D8<=260,IF(F33=\"Ja\",D8-'Format ark'!D13,D8))),0)+IF(AND(D11=\"Ja\",F34=\"Nej\"),D34* IF(D8>261,(IF(F34=\"Ja\",260-'Format ark'!D13,260)),IF(D8<=260,IF(F34=\"Ja\",D8-'Format ark'!D13,D8))),0)+IF(AND(D11=\"Ja\",F35=\"Nej\"),D35* IF(D8>261,(IF(F35=\"Ja\",260-'Format ark'!D13,260)),IF(D8<=260,IF(F35=\"Ja\",D8-'Format ark'!D13,D8))),0)+IF(AND(D11=\"Ja\",F36=\"Nej\"),D36* IF(D8>261,(IF(F36=\"Ja\",260-'Format ark'!D13,260)),IF(D8<=260,IF(F36=\"Ja\",D8-'Format ark'!D13,D8))),0)+IF(AND(D11=\"Ja\",F37=\"Nej\"),D37* IF(D8>261,(IF(F37=\"Ja\",260-'Format ark'!D13,260)),IF(D8<=260,IF(F37=\"Ja\",D8-'Format ark'!D13,D8))),0)+IF(AND(D11=\"Ja\",F38=\"Nej\"),D38* IF(D8>261,(IF(F38=\"Ja\",260-'Format ark'!D13,260)),IF(D8<=260,IF(F38=\"Ja\",D8-'Format ark'!D13,D8))),0)+IF(AND(D11=\"Ja\",F39=\"Nej\"),D39* IF(D8>261,(IF(F39=\"Ja\",260-'Format ark'!D13,260)),IF(D8<=260,IF(F39=\"Ja\",D8-'Format ark'!D13,D8))),0)+IF(AND(D11=\"Ja\",F40=\"Nej\"),D40* IF(D8>261,(IF(F40=\"Ja\",260-'Format ark'!D13,260)),IF(D8<=260,IF(F40=\"Ja\",D8-'Format ark'!D13,D8))),0)","v":0}]
[null,"Estimeret VEU-godtgørelse",null,{"$f":"IF(AND(D11=\"Ja\",F29=\"Ja\"),D29*'Format ark'!D13,0)+IF(AND(D11=\"Ja\",F30=\"Ja\"),D30*'Format ark'!D13,0)+IF(AND(D11=\"Ja\",F31=\"Ja\"),D31*'Format ark'!D13,0)+IF(AND(D11=\"Ja\",F32=\"Ja\"),D32*('Format ark'!D13),0)+IF(AND(D11=\"Ja\",F33=\"Ja\"),D33*'Format ark'!D13,0)+IF(AND(D11=\"Ja\",F34=\"Ja\"),D34*'Format ark'!D13,0)+IF(AND(D11=\"Ja\",F35=\"Ja\"),D35*'Format ark'!D13,0)+IF(AND(D11=\"Ja\",F36=\"Ja\"),D36*'Format ark'!D13,0)+IF(AND(D11=\"Ja\",F37=\"Ja\"),D37*'Format ark'!D13,0)+IF(AND(D11=\"Ja\",F38=\"Ja\"),D38*'Format ark'!D13,0)+IF(AND(D11=\"Ja\",F39=\"Ja\"),D39*'Format ark'!D13,0)+IF(AND(D11=\"Ja\",F40=\"Ja\"),D40*'Format ark'!D13,0)","v":0}]
[null,"Samlet deltagerbetaling (udregner selv)",null,{"$f":"SUM(E29:E40)","v":0}]
[]
[null,"Praktik"]
[null,"Navn på virksomhed og p-nummer"]
[null,"Medarbejderens timeforbrug",null,null,{"$f":"IF(D48>C51*0.5,\"Praktik må maksimalt udgøre 50% af det samlede tidsforbrug.\",\" \")","v":" "}]
[null,"Samlet lønkompensation for praktikopholdet",null,{"$f":"IF(D48>C51*0.5,\"IKKE MULIGT\",D48*(IF(D8>261,260,D8)))","v":0}]
[]
[null,"Samlet tidsforbrug ",{"$f":"IF(D48+D41+D23>300,\"IKKE MULIGT\",D48+D41+D23)","v":0},{"$f":"IF(C51>300,\"Det maksimale tidsforbrug er 300 timer\",\" \")","v":" "}]
[]
[null,"Tidsforbrug til administration","Antal timer","Beløb"]
[null,"Der kan godtgøres op til 5 timer.",null,{"$f":"IF(C54>5,\"Der kan maksimalt godtgøres 5 timer pr. medarbejder.\",C54*260)","v":0}]
[]
[null,"Samlet tilsagnsramme i kr. (maksimal støtte til sporskiftepakken): ",null,{"$f":"IF(AND(C51>300,D49+D44+D42+D26+D24+D54<D63+1),0,MIN(D49+D44+D42+D26+D24+D54,120000))","v":{"$error":"#REF!"}},{"$f":"IF(D56=120000,\"Det maksimale tilsagn pr. sporskiftepakke er nået, og det overstigende beløb er derfor selvbetaling.\",\"\")","v":{"$error":"#REF!"}}]
[]
[]
[null,"Estimeret VEU-godtgørelse",null,{"$f":"D43+D25","v":0}]
[]
[null,"Selvbetaling i kr. (udgifter udover den øvre tilsagnsramme)",null,{"$f":"IF(C51>300,0,MAX(D49+D54+D44+D42+D24+D26-D56,0))","v":{"$error":"#REF!"}}]
[]
[null,"Tilsagnsbeløb i kr.",null,{"$f":"Slutregnskab!J10","v":{"$error":"#REF!"}}]

{"sheet":"Medarbejder 16","index":17,"n_rows":63,"n_cols":6,"rows_kept":63,"cut":false,"hidden":true,"merged":[[62,1,62,2],[60,1,60,2],[16,1,16,2],[33,1,33,2],[58,1,58,2],[46,1,46,2],[34,1,34,2],[22,1,22,2],[23,1,23,2],[24,1,24,2],[25,1,25,2],[27,1,27,2],[28,1,28,2],[29,1,29,2],[30,1,30,2],[31,1,31,2],[8,4,8,5],[21,1,21,2],[9,1,9,2],[9,4,9,5],[10,1,10,2],[11,1,11,3],[12,1,12,3],[14,1,14,3],[17,1,17,2],[18,1,18,2],[19,1,19,2],[20,1,20,2],[1,1,1,3],[3,1,3,3],[5,1,5,2],[6,1,6,2],[8,1,8,2],[7,1,7,2],[32,1,32,2],[48,1,48,2],[55,1,56,2],[55,3,56,3],[47,1,47,2],[35,1,35,2],[36,1,36,2],[37,1,37,2],[38,1,38,2],[39,1,39,2],[40,1,40,2],[41,1,41,2],[42,1,42,2],[43,1,43,2],[45,1,45,2]]}
[]
[null,"Slutregnskab for sporskiftepakken"]
[]
[null,"Oplysninger om medarbejderen"]
[]
[null,"Medarbejderens navn"]
[null,"Medarbejderens lønkompensation fra sporskifte (kr./t.)",null,{"$f":"IF(D8>261,(IF(D11=\"Ja\",260-'Format ark'!D13,260)),IF(D8<=260,IF(D11=\"Ja\",IF(D8<'Format ark'!D13,0,D8-'Format ark'!D13),D8)))","v":0}]
[null,"Medarbejderens timesats (kr./t.)"]
[null,"Medarbejderens højst gennemførte uddannelse",null,null,{"$f":"IF(D9=\"\",\"Husk at vælge medarbejderens højst gennemførte uddannelse.\",\" \")","v":"Husk at vælge medarbejderens højst gennemførte uddannelse."}]
[null,"Har medarbejderen brugt sin uddannelse de senest 5 år?",null,null,{"$f":"IF(D10=\"\",\"Husk at svare på spørgsmålet.\",\" \")","v":"Husk at svare på spørgsmålet."}]
[null,"Medarbejder formodes at være berettiget til at få VEU-godtgørelse ",null,{"$f":"IF(OR(D9=\"Videregående uddannelse\",D9=\"Gymnasial uddannelse\")*AND(D10=\"ja\"),\"Nej\",\"Ja\")","v":"Ja"}]
[null,"Beskriv herunder hvad formålet med den planlagte sporskiftepakke er for medarbejderen:"]
[]
[]
[null,"Aktiviteter"]
[]
[null,"Afklaring, vejledning mv. \nSkriv navn på kursus",null,"Medarbejderens timeforbug (timer)","Evt. deltagerbetaling (kr.)","Giver kurset ret til VEU-godtgørelse?"]
[]
[]
[]
[]
[]
[null,"Samlet antal timer (udregner selv)",null,{"$f":"SUM(D18:D22)","v":0}]
[null,"Samlet lønkompensation udover evt. VEU-godtgørelse (udregner selv)",null,{"$f":"IF(D11=\"Nej\",D23*D7,0)+IF(AND(D11=\"Ja\",F18=\"Ja\"),D18*D7,0)+IF(AND(D11=\"Ja\",F19=\"Ja\"),D19*D7,0)+IF(AND(D11=\"Ja\",F20=\"Ja\"),D20*D7,0)+IF(AND(D11=\"Ja\",F21=\"Ja\"),D21*D7,0)+IF(AND(D11=\"Ja\",F22=\"Ja\"),D22*D7,0)+IF(AND(D11=\"Ja\",F18=\"Nej\"),D18*IF(D8>261,(IF(F18=\"Ja\",260-'Format ark'!D13,260)),IF(D8<=260,IF(F18=\"Ja\",D8-'Format ark'!D13,D8))),0)+IF(AND(D11=\"Ja\",F19=\"Nej\"),D19*IF(D8>261,(IF(F19=\"Ja\",260-'Format ark'!D13,260)),IF(D8<=260,IF(F19=\"Ja\",D8-'Format ark'!D13,D8))),0)+IF(AND(D11=\"Ja\",F20=\"Nej\"),D20*IF(D8>261,(IF(F20=\"Ja\",260-'Format ark'!D13,260)),IF(D8<=260,IF(F20=\"Ja\",D8-'Format ark'!D13,D8))),0)+IF(AND(D11=\"Ja\",F21=\"Nej\"),D21*IF(D8>261,(IF(F21=\"Ja\",260-'Format ark'!D13,260)),IF(D8<=260,IF(F21=\"Ja\",D8-'Format ark'!D13,D8))),0)+IF(AND(D11=\"Ja\",F22=\"Nej\"),D22*IF(D8>261,(IF(F22=\"Ja\",260-'Format ark'!D13,260)),IF(D8<=260,IF(F22=\"Ja\",D8-'Format ark'!D13,D8))),0)","v":0}]
[null,"Estimeret VEU-godtgørelse",null,{"$f":"IF(AND(D11=\"Ja\",F18=\"Ja\"),D18*'Format ark'!D13,0)+IF(AND(D11=\"Ja\",F19=\"Ja\"),D19*'Format ark'!D13,0)+IF(AND(D11=\"Ja\",F20=\"Ja\"),D20*'Format ark'!D13,0)+IF(AND(D11=\"Ja\",F21=\"Ja\"),D21*'Format ark'!D13,0)+IF(AND(D11=\"Ja\",F22=\"Ja\"),D22*'Format ark'!D13,0)","v":0}]
[null,"Samlet deltagerbeltaing (udregner selv)",null,{"$f":"SUM(E18:E22)","v":0}]
[]
[null,"Erhversrettet efteruddannelse\nSkriv navn på efteruddannelse",null,"Medarbejderens timeforbrug (timer)","Evt. deltagerbetaling (kr.)","Giver kurset ret til VEU-godtgørelse?"]
[]
[]
[]
[]
[]
[]
[]
[]
[]
[]
[]
[]
[null,"Samlet antal timer (udregner selv)",null,{"$f":"SUM(D29:D40)","v":0}]
[null,"Samlet lønkompensation udover evt. VEU-godtgørelse (udregner selv)",null,{"$f":"IF(D11=\"Nej\",D41*D7,0)+IF(AND(D11=\"Ja\",F29=\"Ja\"),D29*D7,0)+IF(AND(D11=\"Ja\",F30=\"Ja\"),D30*D7,0)+IF(AND(D11=\"Ja\",F31=\"Ja\"),D31*D7,0)+IF(AND(D11=\"Ja\",F32=\"Ja\"),D32*D7,0)+IF(AND(D11=\"Ja\",F33=\"Ja\"),D33*D7,0)+IF(AND(D11=\"Ja\",F34=\"Ja\"),D34*D7,0)+IF(AND(D11=\"Ja\",F35=\"Ja\"),D35*D7,0)+IF(AND(D11=\"Ja\",F36=\"Ja\"),D36*D7,0)+IF(AND(D11=\"Ja\",F37=\"Ja\"),D37*D7,0)+IF(AND(D11=\"Ja\",F38=\"Ja\"),D38*D7,0)+IF(AND(D11=\"Ja\",F39=\"Ja\"),D39*D7,0)+IF(AND(D11=\"Ja\",F40=\"Ja\"),D40*D7,0)+IF(AND(D11=\"Ja\",F29=\"Nej\"),D29* IF(D8>261,(IF(F29=\"Ja\",260-'Format ark'!D13,260)),IF(D8<=260,IF(F29=\"Ja\",D8-'Format ark'!D13,D8))),0)+IF(AND(D11=\"Ja\",F30=\"Nej\"),D30* IF(D8>261,(IF(F30=\"Ja\",260-'Format ark'!D13,260)),IF(D8<=260,IF(F30=\"Ja\",D8-'Format ark'!D13,D8))),0)+IF(AND(D11=\"Ja\",F31=\"Nej\"),D31* IF(D8>261,(IF(F31=\"Ja\",260-'Format ark'!D13,260)),IF(D8<=260,IF(F31=\"Ja\",D8-'Format ark'!D13,D8))),0)+IF(AND(D11=\"Ja\",F32=\"Nej\"),D32* IF(D8>261,(IF(F32=\"Ja\",260-'Format ark'!D13,260)),IF(D8<=260,IF(F32=\"Ja\",D8-'Format ark'!D13,D8))),0)+IF(AND(D11=\"Ja\",F33=\"Nej\"),D33* IF(D8>261,(IF(F33=\"Ja\",260-'Format ark'!D13,260)),IF(D8<=260,IF(F33=\"Ja\",D8-'Format ark'!D13,D8))),0)+IF(AND(D11=\"Ja\",F34=\"Nej\"),D34* IF(D8>261,(IF(F34=\"Ja\",260-'Format ark'!D13,260)),IF(D8<=260,IF(F34=\"Ja\",D8-'Format ark'!D13,D8))),0)+IF(AND(D11=\"Ja\",F35=\"Nej\"),D35* IF(D8>261,(IF(F35=\"Ja\",260-'Format ark'!D13,260)),IF(D8<=260,IF(F35=\"Ja\",D8-'Format ark'!D13,D8))),0)+IF(AND(D11=\"Ja\",F36=\"Nej\"),D36* IF(D8>261,(IF(F36=\"Ja\",260-'Format ark'!D13,260)),IF(D8<=260,IF(F36=\"Ja\",D8-'Format ark'!D13,D8))),0)+IF(AND(D11=\"Ja\",F37=\"Nej\"),D37* IF(D8>261,(IF(F37=\"Ja\",260-'Format ark'!D13,260)),IF(D8<=260,IF(F37=\"Ja\",D8-'Format ark'!D13,D8))),0)+IF(AND(D11=\"Ja\",F38=\"Nej\"),D38* IF(D8>261,(IF(F38=\"Ja\",260-'Format ark'!D13,260)),IF(D8<=260,IF(F38=\"Ja\",D8-'Format ark'!D13,D8))),0)+IF(AND(D11=\"Ja\",F39=\"Nej\"),D39* IF(D8>261,(IF(F39=\"Ja\",260-'Format ark'!D13,260)),IF(D8<=260,IF(F39=\"Ja\",D8-'Format ark'!D13,D8))),0)+IF(AND(D11=\"Ja\",F40=\"Nej\"),D40* IF(D8>261,(IF(F40=\"Ja\",260-'Format ark'!D13,260)),IF(D8<=260,IF(F40=\"Ja\",D8-'Format ark'!D13,D8))),0)","v":0}]
[null,"Estimeret VEU-godtgørelse",null,{"$f":"IF(AND(D11=\"Ja\",F29=\"Ja\"),D29*'Format ark'!D13,0)+IF(AND(D11=\"Ja\",F30=\"Ja\"),D30*'Format ark'!D13,0)+IF(AND(D11=\"Ja\",F31=\"Ja\"),D31*'Format ark'!D13,0)+IF(AND(D11=\"Ja\",F32=\"Ja\"),D32*('Format ark'!D13),0)+IF(AND(D11=\"Ja\",F33=\"Ja\"),D33*'Format ark'!D13,0)+IF(AND(D11=\"Ja\",F34=\"Ja\"),D34*'Format ark'!D13,0)+IF(AND(D11=\"Ja\",F35=\"Ja\"),D35*'Format ark'!D13,0)+IF(AND(D11=\"Ja\",F36=\"Ja\"),D36*'Format ark'!D13,0)+IF(AND(D11=\"Ja\",F37=\"Ja\"),D37*'Format ark'!D13,0)+IF(AND(D11=\"Ja\",F38=\"Ja\"),D38*'Format ark'!D13,0)+IF(AND(D11=\"Ja\",F39=\"Ja\"),D39*'Format ark'!D13,0)+IF(AND(D11=\"Ja\",F40=\"Ja\"),D40*'Format ark'!D13,0)","v":0}]
[null,"Samlet deltagerbetaling (udregner selv)",null,{"$f":"SUM(E29:E40)","v":0}]
[]
[null,"Praktik"]
[null,"Navn på virksomhed og p-nummer"]
[null,"Medarbejderens timeforbrug",null,null,{"$f":"IF(D48>C51*0.5,\"Praktik må maksimalt udgøre 50% af det samlede tidsforbrug.\",\" \")","v":" "}]
[null,"Samlet lønkompensation for praktikopholdet",null,{"$f":"IF(D48>C51*0.5,\"IKKE MULIGT\",D48*(IF(D8>261,260,D8)))","v":0}]
[]
[null,"Samlet tidsforbrug ",{"$f":"IF(D48+D41+D23>300,\"IKKE MULIGT\",D48+D41+D23)","v":0},{"$f":"IF(C51>300,\"Det maksimale tidsforbrug er 300 timer\",\" \")","v":" "}]
[]
[null,"Tidsforbrug til administration","Antal timer","Beløb"]
[null,"Der kan godtgøres op til 5 timer.",null,{"$f":"IF(C54>5,\"Der kan maksimalt godtgøres 5 timer pr. medarbejder.\",C54*260)","v":0}]
[]
[null,"Samlet tilsagnsramme i kr. (maksimal støtte til sporskiftepakken): ",null,{"$f":"IF(AND(C51>300,D49+D44+D42+D26+D24+D54<D63+1),0,MIN(D49+D44+D42+D26+D24+D54,120000))","v":{"$error":"#REF!"}},{"$f":"IF(D56=120000,\"Det maksimale tilsagn pr. sporskiftepakke er nået, og det overstigende beløb er derfor selvbetaling.\",\"\")","v":{"$error":"#REF!"}}]
[]
[]
[null,"Estimeret VEU-godtgørelse",null,{"$f":"D43+D25","v":0}]
[]
[null,"Selvbetaling i kr. (udgifter udover den øvre tilsagnsramme)",null,{"$f":"IF(C51>300,0,MAX(D49+D54+D44+D42+D24+D26-D56,0))","v":{"$error":"#REF!"}}]
[]
[null,"Tilsagnsbeløb i kr.",null,{"$f":"Slutregnskab!J10","v":{"$error":"#REF!"}}]

{"sheet":"Medarbejder 17","index":18,"n_rows":63,"n_cols":6,"rows_kept":63,"cut":false,"hidden":true,"merged":[[62,1,62,2],[60,1,60,2],[16,1,16,2],[33,1,33,2],[58,1,58,2],[46,1,46,2],[34,1,34,2],[22,1,22,2],[23,1,23,2],[24,1,24,2],[25,1,25,2],[27,1,27,2],[28,1,28,2],[29,1,29,2],[30,1,30,2],[31,1,31,2],[8,4,8,5],[21,1,21,2],[9,1,9,2],[9,4,9,5],[10,1,10,2],[11,1,11,3],[12,1,12,3],[14,1,14,3],[17,1,17,2],[18,1,18,2],[19,1,19,2],[20,1,20,2],[1,1,1,3],[3,1,3,3],[5,1,5,2],[6,1,6,2],[8,1,8,2],[7,1,7,2],[32,1,32,2],[48,1,48,2],[55,1,56,2],[55,3,56,3],[47,1,47,2],[35,1,35,2],[36,1,36,2],[37,1,37,2],[38,1,38,2],[39,1,39,2],[40,1,40,2],[41,1,41,2],[42,1,42,2],[43,1,43,2],[45,1,45,2]]}
[]
[null,"Slutregnskab for sporskiftepakken"]
[]
[null,"Oplysninger om medarbejderen"]
[]
[null,"Medarbejderens navn"]
[null,"Medarbejderens lønkompensation fra sporskifte (kr./t.)",null,{"$f":"IF(D8>261,(IF(D11=\"Ja\",260-'Format ark'!D13,260)),IF(D8<=260,IF(D11=\"Ja\",IF(D8<'Format ark'!D13,0,D8-'Format ark'!D13),D8)))","v":0}]
[null,"Medarbejderens timesats (kr./t.)"]
[null,"Medarbejderens højst gennemførte uddannelse",null,null,{"$f":"IF(D9=\"\",\"Husk at vælge medarbejderens højst gennemførte uddannelse.\",\" \")","v":"Husk at vælge medarbejderens højst gennemførte uddannelse."}]
[null,"Har medarbejderen brugt sin uddannelse de senest 5 år?",null,null,{"$f":"IF(D10=\"\",\"Husk at svare på spørgsmålet.\",\" \")","v":"Husk at svare på spørgsmålet."}]
[null,"Medarbejder formodes at være berettiget til at få VEU-godtgørelse ",null,{"$f":"IF(OR(D9=\"Videregående uddannelse\",D9=\"Gymnasial uddannelse\")*AND(D10=\"ja\"),\"Nej\",\"Ja\")","v":"Ja"}]
[null,"Beskriv herunder hvad formålet med den planlagte sporskiftepakke er for medarbejderen:"]
[]
[]
[null,"Aktiviteter"]
[]
[null,"Afklaring, vejledning mv. \nSkriv navn på kursus",null,"Medarbejderens timeforbug (timer)","Evt. deltagerbetaling (kr.)","Giver kurset ret til VEU-godtgørelse?"]
[]
[]
[]
[]
[]
[null,"Samlet antal timer (udregner selv)",null,{"$f":"SUM(D18:D22)","v":0}]
[null,"Samlet lønkompensation udover evt. VEU-godtgørelse (udregner selv)",null,{"$f":"IF(D11=\"Nej\",D23*D7,0)+IF(AND(D11=\"Ja\",F18=\"Ja\"),D18*D7,0)+IF(AND(D11=\"Ja\",F19=\"Ja\"),D19*D7,0)+IF(AND(D11=\"Ja\",F20=\"Ja\"),D20*D7,0)+IF(AND(D11=\"Ja\",F21=\"Ja\"),D21*D7,0)+IF(AND(D11=\"Ja\",F22=\"Ja\"),D22*D7,0)+IF(AND(D11=\"Ja\",F18=\"Nej\"),D18*IF(D8>261,(IF(F18=\"Ja\",260-'Format ark'!D13,260)),IF(D8<=260,IF(F18=\"Ja\",D8-'Format ark'!D13,D8))),0)+IF(AND(D11=\"Ja\",F19=\"Nej\"),D19*IF(D8>261,(IF(F19=\"Ja\",260-'Format ark'!D13,260)),IF(D8<=260,IF(F19=\"Ja\",D8-'Format ark'!D13,D8))),0)+IF(AND(D11=\"Ja\",F20=\"Nej\"),D20*IF(D8>261,(IF(F20=\"Ja\",260-'Format ark'!D13,260)),IF(D8<=260,IF(F20=\"Ja\",D8-'Format ark'!D13,D8))),0)+IF(AND(D11=\"Ja\",F21=\"Nej\"),D21*IF(D8>261,(IF(F21=\"Ja\",260-'Format ark'!D13,260)),IF(D8<=260,IF(F21=\"Ja\",D8-'Format ark'!D13,D8))),0)+IF(AND(D11=\"Ja\",F22=\"Nej\"),D22*IF(D8>261,(IF(F22=\"Ja\",260-'Format ark'!D13,260)),IF(D8<=260,IF(F22=\"Ja\",D8-'Format ark'!D13,D8))),0)","v":0}]
[null,"Estimeret VEU-godtgørelse",null,{"$f":"IF(AND(D11=\"Ja\",F18=\"Ja\"),D18*'Format ark'!D13,0)+IF(AND(D11=\"Ja\",F19=\"Ja\"),D19*'Format ark'!D13,0)+IF(AND(D11=\"Ja\",F20=\"Ja\"),D20*'Format ark'!D13,0)+IF(AND(D11=\"Ja\",F21=\"Ja\"),D21*'Format ark'!D13,0)+IF(AND(D11=\"Ja\",F22=\"Ja\"),D22*'Format ark'!D13,0)","v":0}]
[null,"Samlet deltagerbeltaing (udregner selv)",null,{"$f":"SUM(E18:E22)","v":0}]
[]
[null,"Erhversrettet efteruddannelse\nSkriv navn på efteruddannelse",null,"Medarbejderens timeforbrug (timer)","Evt. deltagerbetaling (kr.)","Giver kurset ret til VEU-godtgørelse?"]
[]
[]
[]
[]
[]
[]
[]
[]
[]
[]
[]
[]
[null,"Samlet antal timer (udregner selv)",null,{"$f":"SUM(D29:D40)","v":0}]
[null,"Samlet lønkompensation udover evt. VEU-godtgørelse (udregner selv)",null,{"$f":"IF(D11=\"Nej\",D41*D7,0)+IF(AND(D11=\"Ja\",F29=\"Ja\"),D29*D7,0)+IF(AND(D11=\"Ja\",F30=\"Ja\"),D30*D7,0)+IF(AND(D11=\"Ja\",F31=\"Ja\"),D31*D7,0)+IF(AND(D11=\"Ja\",F32=\"Ja\"),D32*D7,0)+IF(AND(D11=\"Ja\",F33=\"Ja\"),D33*D7,0)+IF(AND(D11=\"Ja\",F34=\"Ja\"),D34*D7,0)+IF(AND(D11=\"Ja\",F35=\"Ja\"),D35*D7,0)+IF(AND(D11=\"Ja\",F36=\"Ja\"),D36*D7,0)+IF(AND(D11=\"Ja\",F37=\"Ja\"),D37*D7,0)+IF(AND(D11=\"Ja\",F38=\"Ja\"),D38*D7,0)+IF(AND(D11=\"Ja\",F39=\"Ja\"),D39*D7,0)+IF(AND(D11=\"Ja\",F40=\"Ja\"),D40*D7,0)+IF(AND(D11=\"Ja\",F29=\"Nej\"),D29* IF(D8>261,(IF(F29=\"Ja\",260-'Format ark'!D13,260)),IF(D8<=260,IF(F29=\"Ja\",D8-'Format ark'!D13,D8))),0)+IF(AND(D11=\"Ja\",F30=\"Nej\"),D30* IF(D8>261,(IF(F30=\"Ja\",260-'Format ark'!D13,260)),IF(D8<=260,IF(F30=\"Ja\",D8-'Format ark'!D13,D8))),0)+IF(AND(D11=\"Ja\",F31=\"Nej\"),D31* IF(D8>261,(IF(F31=\"Ja\",260-'Format ark'!D13,260)),IF(D8<=260,IF(F31=\"Ja\",D8-'Format ark'!D13,D8))),0)+IF(AND(D11=\"Ja\",F32=\"Nej\"),D32* IF(D8>261,(IF(F32=\"Ja\",260-'Format ark'!D13,260)),IF(D8<=260,IF(F32=\"Ja\",D8-'Format ark'!D13,D8))),0)+IF(AND(D11=\"Ja\",F33=\"Nej\"),D33* IF(D8>261,(IF(F33=\"Ja\",260-'Format ark'!D13,260)),IF(D8<=260,IF(F33=\"Ja\",D8-'Format ark'!D13,D8))),0)+IF(AND(D11=\"Ja\",F34=\"Nej\"),D34* IF(D8>261,(IF(F34=\"Ja\",260-'Format ark'!D13,260)),IF(D8<=260,IF(F34=\"Ja\",D8-'Format ark'!D13,D8))),0)+IF(AND(D11=\"Ja\",F35=\"Nej\"),D35* IF(D8>261,(IF(F35=\"Ja\",260-'Format ark'!D13,260)),IF(D8<=260,IF(F35=\"Ja\",D8-'Format ark'!D13,D8))),0)+IF(AND(D11=\"Ja\",F36=\"Nej\"),D36* IF(D8>261,(IF(F36=\"Ja\",260-'Format ark'!D13,260)),IF(D8<=260,IF(F36=\"Ja\",D8-'Format ark'!D13,D8))),0)+IF(AND(D11=\"Ja\",F37=\"Nej\"),D37* IF(D8>261,(IF(F37=\"Ja\",260-'Format ark'!D13,260)),IF(D8<=260,IF(F37=\"Ja\",D8-'Format ark'!D13,D8))),0)+IF(AND(D11=\"Ja\",F38=\"Nej\"),D38* IF(D8>261,(IF(F38=\"Ja\",260-'Format ark'!D13,260)),IF(D8<=260,IF(F38=\"Ja\",D8-'Format ark'!D13,D8))),0)+IF(AND(D11=\"Ja\",F39=\"Nej\"),D39* IF(D8>261,(IF(F39=\"Ja\",260-'Format ark'!D13,260)),IF(D8<=260,IF(F39=\"Ja\",D8-'Format ark'!D13,D8))),0)+IF(AND(D11=\"Ja\",F40=\"Nej\"),D40* IF(D8>261,(IF(F40=\"Ja\",260-'Format ark'!D13,260)),IF(D8<=260,IF(F40=\"Ja\",D8-'Format ark'!D13,D8))),0)","v":0}]
[null,"Estimeret VEU-godtgørelse",null,{"$f":"IF(AND(D11=\"Ja\",F29=\"Ja\"),D29*'Format ark'!D13,0)+IF(AND(D11=\"Ja\",F30=\"Ja\"),D30*'Format ark'!D13,0)+IF(AND(D11=\"Ja\",F31=\"Ja\"),D31*'Format ark'!D13,0)+IF(AND(D11=\"Ja\",F32=\"Ja\"),D32*('Format ark'!D13),0)+IF(AND(D11=\"Ja\",F33=\"Ja\"),D33*'Format ark'!D13,0)+IF(AND(D11=\"Ja\",F34=\"Ja\"),D34*'Format ark'!D13,0)+IF(AND(D11=\"Ja\",F35=\"Ja\"),D35*'Format ark'!D13,0)+IF(AND(D11=\"Ja\",F36=\"Ja\"),D36*'Format ark'!D13,0)+IF(AND(D11=\"Ja\",F37=\"Ja\"),D37*'Format ark'!D13,0)+IF(AND(D11=\"Ja\",F38=\"Ja\"),D38*'Format ark'!D13,0)+IF(AND(D11=\"Ja\",F39=\"Ja\"),D39*'Format ark'!D13,0)+IF(AND(D11=\"Ja\",F40=\"Ja\"),D40*'Format ark'!D13,0)","v":0}]
[null,"Samlet deltagerbetaling (udregner selv)",null,{"$f":"SUM(E29:E40)","v":0}]
[]
[null,"Praktik"]
[null,"Navn på virksomhed og p-nummer"]
[null,"Medarbejderens timeforbrug",null,null,{"$f":"IF(D48>C51*0.5,\"Praktik må maksimalt udgøre 50% af det samlede tidsforbrug.\",\" \")","v":" "}]
[null,"Samlet lønkompensation for praktikopholdet",null,{"$f":"IF(D48>C51*0.5,\"IKKE MULIGT\",D48*(IF(D8>261,260,D8)))","v":0}]
[]
[null,"Samlet tidsforbrug ",{"$f":"IF(D48+D41+D23>300,\"IKKE MULIGT\",D48+D41+D23)","v":0},{"$f":"IF(C51>300,\"Det maksimale tidsforbrug er 300 timer\",\" \")","v":" "}]
[]
[null,"Tidsforbrug til administration","Antal timer","Beløb"]
[null,"Der kan godtgøres op til 5 timer.",null,{"$f":"IF(C54>5,\"Der kan maksimalt godtgøres 5 timer pr. medarbejder.\",C54*260)","v":0}]
[]
[null,"Samlet tilsagnsramme i kr. (maksimal støtte til sporskiftepakken): ",null,{"$f":"IF(AND(C51>300,D49+D44+D42+D26+D24+D54<D63+1),0,MIN(D49+D44+D42+D26+D24+D54,120000))","v":{"$error":"#REF!"}},{"$f":"IF(D56=120000,\"Det maksimale tilsagn pr. sporskiftepakke er nået, og det overstigende beløb er derfor selvbetaling.\",\"\")","v":{"$error":"#REF!"}}]
[]
[]
[null,"Estimeret VEU-godtgørelse",null,{"$f":"D43+D25","v":0}]
[]
[null,"Selvbetaling i kr. (udgifter udover den øvre tilsagnsramme)",null,{"$f":"IF(C51>300,0,MAX(D49+D54+D44+D42+D24+D26-D56,0))","v":{"$error":"#REF!"}}]
[]
[null,"Tilsagnsbeløb i kr.",null,{"$f":"Slutregnskab!J10","v":{"$error":"#REF!"}}]

{"sheet":"Medarbejder 18","index":19,"n_rows":63,"n_cols":6,"rows_kept":63,"cut":false,"hidden":true,"merged":[[62,1,62,2],[60,1,60,2],[16,1,16,2],[33,1,33,2],[58,1,58,2],[46,1,46,2],[34,1,34,2],[22,1,22,2],[23,1,23,2],[24,1,24,2],[25,1,25,2],[27,1,27,2],[28,1,28,2],[29,1,29,2],[30,1,30,2],[31,1,31,2],[8,4,8,5],[21,1,21,2],[9,1,9,2],[9,4,9,5],[10,1,10,2],[11,1,11,3],[12,1,12,3],[14,1,14,3],[17,1,17,2],[18,1,18,2],[19,1,19,2],[20,1,20,2],[1,1,1,3],[3,1,3,3],[5,1,5,2],[6,1,6,2],[8,1,8,2],[7,1,7,2],[32,1,32,2],[48,1,48,2],[55,1,56,2],[55,3,56,3],[47,1,47,2],[35,1,35,2],[36,1,36,2],[37,1,37,2],[38,1,38,2],[39,1,39,2],[40,1,40,2],[41,1,41,2],[42,1,42,2],[43,1,43,2],[45,1,45,2]]}
[]
[null,"Slutregnskab for sporskiftepakken"]
[]
[null,"Oplysninger om medarbejderen"]
[]
[null,"Medarbejderens navn"]
[null,"Medarbejderens lønkompensation fra sporskifte (kr./t.)",null,{"$f":"IF(D8>261,(IF(D11=\"Ja\",260-'Format ark'!D13,260)),IF(D8<=260,IF(D11=\"Ja\",IF(D8<'Format ark'!D13,0,D8-'Format ark'!D13),D8)))","v":0}]
[null,"Medarbejderens timesats (kr./t.)"]
[null,"Medarbejderens højst gennemførte uddannelse",null,null,{"$f":"IF(D9=\"\",\"Husk at vælge medarbejderens højst gennemførte uddannelse.\",\" \")","v":"Husk at vælge medarbejderens højst gennemførte uddannelse."}]
[null,"Har medarbejderen brugt sin uddannelse de senest 5 år?",null,null,{"$f":"IF(D10=\"\",\"Husk at svare på spørgsmålet.\",\" \")","v":"Husk at svare på spørgsmålet."}]
[null,"Medarbejder formodes at være berettiget til at få VEU-godtgørelse ",null,{"$f":"IF(OR(D9=\"Videregående uddannelse\",D9=\"Gymnasial uddannelse\")*AND(D10=\"ja\"),\"Nej\",\"Ja\")","v":"Ja"}]
[null,"Beskriv herunder hvad formålet med den planlagte sporskiftepakke er for medarbejderen:"]
[]
[]
[null,"Aktiviteter"]
[]
[null,"Afklaring, vejledning mv. \nSkriv navn på kursus",null,"Medarbejderens timeforbug (timer)","Evt. deltagerbetaling (kr.)","Giver kurset ret til VEU-godtgørelse?"]
[]
[]
[]
[]
[]
[null,"Samlet antal timer (udregner selv)",null,{"$f":"SUM(D18:D22)","v":0}]
[null,"Samlet lønkompensation udover evt. VEU-godtgørelse (udregner selv)",null,{"$f":"IF(D11=\"Nej\",D23*D7,0)+IF(AND(D11=\"Ja\",F18=\"Ja\"),D18*D7,0)+IF(AND(D11=\"Ja\",F19=\"Ja\"),D19*D7,0)+IF(AND(D11=\"Ja\",F20=\"Ja\"),D20*D7,0)+IF(AND(D11=\"Ja\",F21=\"Ja\"),D21*D7,0)+IF(AND(D11=\"Ja\",F22=\"Ja\"),D22*D7,0)+IF(AND(D11=\"Ja\",F18=\"Nej\"),D18*IF(D8>261,(IF(F18=\"Ja\",260-'Format ark'!D13,260)),IF(D8<=260,IF(F18=\"Ja\",D8-'Format ark'!D13,D8))),0)+IF(AND(D11=\"Ja\",F19=\"Nej\"),D19*IF(D8>261,(IF(F19=\"Ja\",260-'Format ark'!D13,260)),IF(D8<=260,IF(F19=\"Ja\",D8-'Format ark'!D13,D8))),0)+IF(AND(D11=\"Ja\",F20=\"Nej\"),D20*IF(D8>261,(IF(F20=\"Ja\",260-'Format ark'!D13,260)),IF(D8<=260,IF(F20=\"Ja\",D8-'Format ark'!D13,D8))),0)+IF(AND(D11=\"Ja\",F21=\"Nej\"),D21*IF(D8>261,(IF(F21=\"Ja\",260-'Format ark'!D13,260)),IF(D8<=260,IF(F21=\"Ja\",D8-'Format ark'!D13,D8))),0)+IF(AND(D11=\"Ja\",F22=\"Nej\"),D22*IF(D8>261,(IF(F22=\"Ja\",260-'Format ark'!D13,260)),IF(D8<=260,IF(F22=\"Ja\",D8-'Format ark'!D13,D8))),0)","v":0}]
[null,"Estimeret VEU-godtgørelse",null,{"$f":"IF(AND(D11=\"Ja\",F18=\"Ja\"),D18*'Format ark'!D13,0)+IF(AND(D11=\"Ja\",F19=\"Ja\"),D19*'Format ark'!D13,0)+IF(AND(D11=\"Ja\",F20=\"Ja\"),D20*'Format ark'!D13,0)+IF(AND(D11=\"Ja\",F21=\"Ja\"),D21*'Format ark'!D13,0)+IF(AND(D11=\"Ja\",F22=\"Ja\"),D22*'Format ark'!D13,0)","v":0}]
[null,"Samlet deltagerbeltaing (udregner selv)",null,{"$f":"SUM(E18:E22)","v":0}]
[]
[null,"Erhversrettet efteruddannelse\nSkriv navn på efteruddannelse",null,"Medarbejderens timeforbrug (timer)","Evt. deltagerbetaling (kr.)","Giver kurset ret til VEU-godtgørelse?"]
[]
[]
[]
[]
[]
[]
[]
[]
[]
[]
[]
[]
[null,"Samlet antal timer (udregner selv)",null,{"$f":"SUM(D29:D40)","v":0}]
[null,"Samlet lønkompensation udover evt. VEU-godtgørelse (udregner selv)",null,{"$f":"IF(D11=\"Nej\",D41*D7,0)+IF(AND(D11=\"Ja\",F29=\"Ja\"),D29*D7,0)+IF(AND(D11=\"Ja\",F30=\"Ja\"),D30*D7,0)+IF(AND(D11=\"Ja\",F31=\"Ja\"),D31*D7,0)+IF(AND(D11=\"Ja\",F32=\"Ja\"),D32*D7,0)+IF(AND(D11=\"Ja\",F33=\"Ja\"),D33*D7,0)+IF(AND(D11=\"Ja\",F34=\"Ja\"),D34*D7,0)+IF(AND(D11=\"Ja\",F35=\"Ja\"),D35*D7,0)+IF(AND(D11=\"Ja\",F36=\"Ja\"),D36*D7,0)+IF(AND(D11=\"Ja\",F37=\"Ja\"),D37*D7,0)+IF(AND(D11=\"Ja\",F38=\"Ja\"),D38*D7,0)+IF(AND(D11=\"Ja\",F39=\"Ja\"),D39*D7,0)+IF(AND(D11=\"Ja\",F40=\"Ja\"),D40*D7,0)+IF(AND(D11=\"Ja\",F29=\"Nej\"),D29* IF(D8>261,(IF(F29=\"Ja\",260-'Format ark'!D13,260)),IF(D8<=260,IF(F29=\"Ja\",D8-'Format ark'!D13,D8))),0)+IF(AND(D11=\"Ja\",F30=\"Nej\"),D30* IF(D8>261,(IF(F30=\"Ja\",260-'Format ark'!D13,260)),IF(D8<=260,IF(F30=\"Ja\",D8-'Format ark'!D13,D8))),0)+IF(AND(D11=\"Ja\",F31=\"Nej\"),D31* IF(D8>261,(IF(F31=\"Ja\",260-'Format ark'!D13,260)),IF(D8<=260,IF(F31=\"Ja\",D8-'Format ark'!D13,D8))),0)+IF(AND(D11=\"Ja\",F32=\"Nej\"),D32* IF(D8>261,(IF(F32=\"Ja\",260-'Format ark'!D13,260)),IF(D8<=260,IF(F32=\"Ja\",D8-'Format ark'!D13,D8))),0)+IF(AND(D11=\"Ja\",F33=\"Nej\"),D33* IF(D8>261,(IF(F33=\"Ja\",260-'Format ark'!D13,260)),IF(D8<=260,IF(F33=\"Ja\",D8-'Format ark'!D13,D8))),0)+IF(AND(D11=\"Ja\",F34=\"Nej\"),D34* IF(D8>261,(IF(F34=\"Ja\",260-'Format ark'!D13,260)),IF(D8<=260,IF(F34=\"Ja\",D8-'Format ark'!D13,D8))),0)+IF(AND(D11=\"Ja\",F35=\"Nej\"),D35* IF(D8>261,(IF(F35=\"Ja\",260-'Format ark'!D13,260)),IF(D8<=260,IF(F35=\"Ja\",D8-'Format ark'!D13,D8))),0)+IF(AND(D11=\"Ja\",F36=\"Nej\"),D36* IF(D8>261,(IF(F36=\"Ja\",260-'Format ark'!D13,260)),IF(D8<=260,IF(F36=\"Ja\",D8-'Format ark'!D13,D8))),0)+IF(AND(D11=\"Ja\",F37=\"Nej\"),D37* IF(D8>261,(IF(F37=\"Ja\",260-'Format ark'!D13,260)),IF(D8<=260,IF(F37=\"Ja\",D8-'Format ark'!D13,D8))),0)+IF(AND(D11=\"Ja\",F38=\"Nej\"),D38* IF(D8>261,(IF(F38=\"Ja\",260-'Format ark'!D13,260)),IF(D8<=260,IF(F38=\"Ja\",D8-'Format ark'!D13,D8))),0)+IF(AND(D11=\"Ja\",F39=\"Nej\"),D39* IF(D8>261,(IF(F39=\"Ja\",260-'Format ark'!D13,260)),IF(D8<=260,IF(F39=\"Ja\",D8-'Format ark'!D13,D8))),0)+IF(AND(D11=\"Ja\",F40=\"Nej\"),D40* IF(D8>261,(IF(F40=\"Ja\",260-'Format ark'!D13,260)),IF(D8<=260,IF(F40=\"Ja\",D8-'Format ark'!D13,D8))),0)","v":0}]
[null,"Estimeret VEU-godtgørelse",null,{"$f":"IF(AND(D11=\"Ja\",F29=\"Ja\"),D29*'Format ark'!D13,0)+IF(AND(D11=\"Ja\",F30=\"Ja\"),D30*'Format ark'!D13,0)+IF(AND(D11=\"Ja\",F31=\"Ja\"),D31*'Format ark'!D13,0)+IF(AND(D11=\"Ja\",F32=\"Ja\"),D32*('Format ark'!D13),0)+IF(AND(D11=\"Ja\",F33=\"Ja\"),D33*'Format ark'!D13,0)+IF(AND(D11=\"Ja\",F34=\"Ja\"),D34*'Format ark'!D13,0)+IF(AND(D11=\"Ja\",F35=\"Ja\"),D35*'Format ark'!D13,0)+IF(AND(D11=\"Ja\",F36=\"Ja\"),D36*'Format ark'!D13,0)+IF(AND(D11=\"Ja\",F37=\"Ja\"),D37*'Format ark'!D13,0)+IF(AND(D11=\"Ja\",F38=\"Ja\"),D38*'Format ark'!D13,0)+IF(AND(D11=\"Ja\",F39=\"Ja\"),D39*'Format ark'!D13,0)+IF(AND(D11=\"Ja\",F40=\"Ja\"),D40*'Format ark'!D13,0)","v":0}]
[null,"Samlet deltagerbetaling (udregner selv)",null,{"$f":"SUM(E29:E40)","v":0}]
[]
[null,"Praktik"]
[null,"Navn på virksomhed og p-nummer"]
[null,"Medarbejderens timeforbrug",null,null,{"$f":"IF(D48>C51*0.5,\"Praktik må maksimalt udgøre 50% af det samlede tidsforbrug.\",\" \")","v":" "}]
[null,"Samlet lønkompensation for praktikopholdet",null,{"$f":"IF(D48>C51*0.5,\"IKKE MULIGT\",D48*(IF(D8>261,260,D8)))","v":0}]
[]
[null,"Samlet tidsforbrug ",{"$f":"IF(D48+D41+D23>300,\"IKKE MULIGT\",D48+D41+D23)","v":0},{"$f":"IF(C51>300,\"Det maksimale tidsforbrug er 300 timer\",\" \")","v":" "}]
[]
[null,"Tidsforbrug til administration","Antal timer","Beløb"]
[null,"Der kan godtgøres op til 5 timer.",null,{"$f":"IF(C54>5,\"Der kan maksimalt godtgøres 5 timer pr. medarbejder.\",C54*260)","v":0}]
[]
[null,"Samlet tilsagnsramme i kr. (maksimal støtte til sporskiftepakken): ",null,{"$f":"IF(AND(C51>300,D49+D44+D42+D26+D24+D54<D63+1),0,MIN(D49+D44+D42+D26+D24+D54,120000))","v":{"$error":"#REF!"}},{"$f":"IF(D56=120000,\"Det maksimale tilsagn pr. sporskiftepakke er nået, og det overstigende beløb er derfor selvbetaling.\",\"\")","v":{"$error":"#REF!"}}]
[]
[]
[null,"Estimeret VEU-godtgørelse",null,{"$f":"D43+D25","v":0}]
[]
[null,"Selvbetaling i kr. (udgifter udover den øvre tilsagnsramme)",null,{"$f":"IF(C51>300,0,MAX(D49+D54+D44+D42+D24+D26-D56,0))","v":{"$error":"#REF!"}}]
[]
[null,"Tilsagnsbeløb i kr.",null,{"$f":"Slutregnskab!J10","v":{"$error":"#REF!"}}]

{"sheet":"Medarbejder 19","index":20,"n_rows":63,"n_cols":6,"rows_kept":63,"cut":false,"hidden":true,"merged":[[62,1,62,2],[60,1,60,2],[16,1,16,2],[33,1,33,2],[58,1,58,2],[46,1,46,2],[34,1,34,2],[22,1,22,2],[23,1,23,2],[24,1,24,2],[25,1,25,2],[27,1,27,2],[28,1,28,2],[29,1,29,2],[30,1,30,2],[31,1,31,2],[8,4,8,5],[21,1,21,2],[9,1,9,2],[9,4,9,5],[10,1,10,2],[11,1,11,3],[12,1,12,3],[14,1,14,3],[17,1,17,2],[18,1,18,2],[19,1,19,2],[20,1,20,2],[1,1,1,3],[3,1,3,3],[5,1,5,2],[6,1,6,2],[8,1,8,2],[7,1,7,2],[32,1,32,2],[48,1,48,2],[55,1,56,2],[55,3,56,3],[47,1,47,2],[35,1,35,2],[36,1,36,2],[37,1,37,2],[38,1,38,2],[39,1,39,2],[40,1,40,2],[41,1,41,2],[42,1,42,2],[43,1,43,2],[45,1,45,2]]}
[]
[null,"Slutregnskab for sporskiftepakken"]
[]
[null,"Oplysninger om medarbejderen"]
[]
[null,"Medarbejderens navn"]
[null,"Medarbejderens lønkompensation fra sporskifte (kr./t.)",null,{"$f":"IF(D8>261,(IF(D11=\"Ja\",260-'Format ark'!D13,260)),IF(D8<=260,IF(D11=\"Ja\",IF(D8<'Format ark'!D13,0,D8-'Format ark'!D13),D8)))","v":0}]
[null,"Medarbejderens timesats (kr./t.)"]
[null,"Medarbejderens højst gennemførte uddannelse",null,null,{"$f":"IF(D9=\"\",\"Husk at vælge medarbejderens højst gennemførte uddannelse.\",\" \")","v":"Husk at vælge medarbejderens højst gennemførte uddannelse."}]
[null,"Har medarbejderen brugt sin uddannelse de senest 5 år?",null,null,{"$f":"IF(D10=\"\",\"Husk at svare på spørgsmålet.\",\" \")","v":"Husk at svare på spørgsmålet."}]
[null,"Medarbejder formodes at være berettiget til at få VEU-godtgørelse ",null,{"$f":"IF(OR(D9=\"Videregående uddannelse\",D9=\"Gymnasial uddannelse\")*AND(D10=\"ja\"),\"Nej\",\"Ja\")","v":"Ja"}]
[null,"Beskriv herunder hvad formålet med den planlagte sporskiftepakke er for medarbejderen:"]
[]
[]
[null,"Aktiviteter"]
[]
[null,"Afklaring, vejledning mv. \nSkriv navn på kursus",null,"Medarbejderens timeforbug (timer)","Evt. deltagerbetaling (kr.)","Giver kurset ret til VEU-godtgørelse?"]
[]
[]
[]
[]
[]
[null,"Samlet antal timer (udregner selv)",null,{"$f":"SUM(D18:D22)","v":0}]
[null,"Samlet lønkompensation udover evt. VEU-godtgørelse (udregner selv)",null,{"$f":"IF(D11=\"Nej\",D23*D7,0)+IF(AND(D11=\"Ja\",F18=\"Ja\"),D18*D7,0)+IF(AND(D11=\"Ja\",F19=\"Ja\"),D19*D7,0)+IF(AND(D11=\"Ja\",F20=\"Ja\"),D20*D7,0)+IF(AND(D11=\"Ja\",F21=\"Ja\"),D21*D7,0)+IF(AND(D11=\"Ja\",F22=\"Ja\"),D22*D7,0)+IF(AND(D11=\"Ja\",F18=\"Nej\"),D18*IF(D8>261,(IF(F18=\"Ja\",260-'Format ark'!D13,260)),IF(D8<=260,IF(F18=\"Ja\",D8-'Format ark'!D13,D8))),0)+IF(AND(D11=\"Ja\",F19=\"Nej\"),D19*IF(D8>261,(IF(F19=\"Ja\",260-'Format ark'!D13,260)),IF(D8<=260,IF(F19=\"Ja\",D8-'Format ark'!D13,D8))),0)+IF(AND(D11=\"Ja\",F20=\"Nej\"),D20*IF(D8>261,(IF(F20=\"Ja\",260-'Format ark'!D13,260)),IF(D8<=260,IF(F20=\"Ja\",D8-'Format ark'!D13,D8))),0)+IF(AND(D11=\"Ja\",F21=\"Nej\"),D21*IF(D8>261,(IF(F21=\"Ja\",260-'Format ark'!D13,260)),IF(D8<=260,IF(F21=\"Ja\",D8-'Format ark'!D13,D8))),0)+IF(AND(D11=\"Ja\",F22=\"Nej\"),D22*IF(D8>261,(IF(F22=\"Ja\",260-'Format ark'!D13,260)),IF(D8<=260,IF(F22=\"Ja\",D8-'Format ark'!D13,D8))),0)","v":0}]
[null,"Estimeret VEU-godtgørelse",null,{"$f":"IF(AND(D11=\"Ja\",F18=\"Ja\"),D18*'Format ark'!D13,0)+IF(AND(D11=\"Ja\",F19=\"Ja\"),D19*'Format ark'!D13,0)+IF(AND(D11=\"Ja\",F20=\"Ja\"),D20*'Format ark'!D13,0)+IF(AND(D11=\"Ja\",F21=\"Ja\"),D21*'Format ark'!D13,0)+IF(AND(D11=\"Ja\",F22=\"Ja\"),D22*'Format ark'!D13,0)","v":0}]
[null,"Samlet deltagerbeltaing (udregner selv)",null,{"$f":"SUM(E18:E22)","v":0}]
[]
[null,"Erhversrettet efteruddannelse\nSkriv navn på efteruddannelse",null,"Medarbejderens timeforbrug (timer)","Evt. deltagerbetaling (kr.)","Giver kurset ret til VEU-godtgørelse?"]
[]
[]
[]
[]
[]
[]
[]
[]
[]
[]
[]
[]
[null,"Samlet antal timer (udregner selv)",null,{"$f":"SUM(D29:D40)","v":0}]
[null,"Samlet lønkompensation udover evt. VEU-godtgørelse (udregner selv)",null,{"$f":"IF(D11=\"Nej\",D41*D7,0)+IF(AND(D11=\"Ja\",F29=\"Ja\"),D29*D7,0)+IF(AND(D11=\"Ja\",F30=\"Ja\"),D30*D7,0)+IF(AND(D11=\"Ja\",F31=\"Ja\"),D31*D7,0)+IF(AND(D11=\"Ja\",F32=\"Ja\"),D32*D7,0)+IF(AND(D11=\"Ja\",F33=\"Ja\"),D33*D7,0)+IF(AND(D11=\"Ja\",F34=\"Ja\"),D34*D7,0)+IF(AND(D11=\"Ja\",F35=\"Ja\"),D35*D7,0)+IF(AND(D11=\"Ja\",F36=\"Ja\"),D36*D7,0)+IF(AND(D11=\"Ja\",F37=\"Ja\"),D37*D7,0)+IF(AND(D11=\"Ja\",F38=\"Ja\"),D38*D7,0)+IF(AND(D11=\"Ja\",F39=\"Ja\"),D39*D7,0)+IF(AND(D11=\"Ja\",F40=\"Ja\"),D40*D7,0)+IF(AND(D11=\"Ja\",F29=\"Nej\"),D29* IF(D8>261,(IF(F29=\"Ja\",260-'Format ark'!D13,260)),IF(D8<=260,IF(F29=\"Ja\",D8-'Format ark'!D13,D8))),0)+IF(AND(D11=\"Ja\",F30=\"Nej\"),D30* IF(D8>261,(IF(F30=\"Ja\",260-'Format ark'!D13,260)),IF(D8<=260,IF(F30=\"Ja\",D8-'Format ark'!D13,D8))),0)+IF(AND(D11=\"Ja\",F31=\"Nej\"),D31* IF(D8>261,(IF(F31=\"Ja\",260-'Format ark'!D13,260)),IF(D8<=260,IF(F31=\"Ja\",D8-'Format ark'!D13,D8))),0)+IF(AND(D11=\"Ja\",F32=\"Nej\"),D32* IF(D8>261,(IF(F32=\"Ja\",260-'Format ark'!D13,260)),IF(D8<=260,IF(F32=\"Ja\",D8-'Format ark'!D13,D8))),0)+IF(AND(D11=\"Ja\",F33=\"Nej\"),D33* IF(D8>261,(IF(F33=\"Ja\",260-'Format ark'!D13,260)),IF(D8<=260,IF(F33=\"Ja\",D8-'Format ark'!D13,D8))),0)+IF(AND(D11=\"Ja\",F34=\"Nej\"),D34* IF(D8>261,(IF(F34=\"Ja\",260-'Format ark'!D13,260)),IF(D8<=260,IF(F34=\"Ja\",D8-'Format ark'!D13,D8))),0)+IF(AND(D11=\"Ja\",F35=\"Nej\"),D35* IF(D8>261,(IF(F35=\"Ja\",260-'Format ark'!D13,260)),IF(D8<=260,IF(F35=\"Ja\",D8-'Format ark'!D13,D8))),0)+IF(AND(D11=\"Ja\",F36=\"Nej\"),D36* IF(D8>261,(IF(F36=\"Ja\",260-'Format ark'!D13,260)),IF(D8<=260,IF(F36=\"Ja\",D8-'Format ark'!D13,D8))),0)+IF(AND(D11=\"Ja\",F37=\"Nej\"),D37* IF(D8>261,(IF(F37=\"Ja\",260-'Format ark'!D13,260)),IF(D8<=260,IF(F37=\"Ja\",D8-'Format ark'!D13,D8))),0)+IF(AND(D11=\"Ja\",F38=\"Nej\"),D38* IF(D8>261,(IF(F38=\"Ja\",260-'Format ark'!D13,260)),IF(D8<=260,IF(F38=\"Ja\",D8-'Format ark'!D13,D8))),0)+IF(AND(D11=\"Ja\",F39=\"Nej\"),D39* IF(D8>261,(IF(F39=\"Ja\",260-'Format ark'!D13,260)),IF(D8<=260,IF(F39=\"Ja\",D8-'Format ark'!D13,D8))),0)+IF(AND(D11=\"Ja\",F40=\"Nej\"),D40* IF(D8>261,(IF(F40=\"Ja\",260-'Format ark'!D13,260)),IF(D8<=260,IF(F40=\"Ja\",D8-'Format ark'!D13,D8))),0)","v":0}]
[null,"Estimeret VEU-godtgørelse",null,{"$f":"IF(AND(D11=\"Ja\",F29=\"Ja\"),D29*'Format ark'!D13,0)+IF(AND(D11=\"Ja\",F30=\"Ja\"),D30*'Format ark'!D13,0)+IF(AND(D11=\"Ja\",F31=\"Ja\"),D31*'Format ark'!D13,0)+IF(AND(D11=\"Ja\",F32=\"Ja\"),D32*('Format ark'!D13),0)+IF(AND(D11=\"Ja\",F33=\"Ja\"),D33*'Format ark'!D13,0)+IF(AND(D11=\"Ja\",F34=\"Ja\"),D34*'Format ark'!D13,0)+IF(AND(D11=\"Ja\",F35=\"Ja\"),D35*'Format ark'!D13,0)+IF(AND(D11=\"Ja\",F36=\"Ja\"),D36*'Format ark'!D13,0)+IF(AND(D11=\"Ja\",F37=\"Ja\"),D37*'Format ark'!D13,0)+IF(AND(D11=\"Ja\",F38=\"Ja\"),D38*'Format ark'!D13,0)+IF(AND(D11=\"Ja\",F39=\"Ja\"),D39*'Format ark'!D13,0)+IF(AND(D11=\"Ja\",F40=\"Ja\"),D40*'Format ark'!D13,0)","v":0}]
[null,"Samlet deltagerbetaling (udregner selv)",null,{"$f":"SUM(E29:E40)","v":0}]
[]
[null,"Praktik"]
[null,"Navn på virksomhed og p-nummer"]
[null,"Medarbejderens timeforbrug",null,null,{"$f":"IF(D48>C51*0.5,\"Praktik må maksimalt udgøre 50% af det samlede tidsforbrug.\",\" \")","v":" "}]
[null,"Samlet lønkompensation for praktikopholdet",null,{"$f":"IF(D48>C51*0.5,\"IKKE MULIGT\",D48*(IF(D8>261,260,D8)))","v":0}]
[]
[null,"Samlet tidsforbrug ",{"$f":"IF(D48+D41+D23>300,\"IKKE MULIGT\",D48+D41+D23)","v":0},{"$f":"IF(C51>300,\"Det maksimale tidsforbrug er 300 timer\",\" \")","v":" "}]
[]
[null,"Tidsforbrug til administration","Antal timer","Beløb"]
[null,"Der kan godtgøres op til 5 timer.",null,{"$f":"IF(C54>5,\"Der kan maksimalt godtgøres 5 timer pr. medarbejder.\",C54*260)","v":0}]
[]
[null,"Samlet tilsagnsramme i kr. (maksimal støtte til sporskiftepakken): ",null,{"$f":"IF(AND(C51>300,D49+D44+D42+D26+D24+D54<D63+1),0,MIN(D49+D44+D42+D26+D24+D54,120000))","v":{"$error":"#REF!"}},{"$f":"IF(D56=120000,\"Det maksimale tilsagn pr. sporskiftepakke er nået, og det overstigende beløb er derfor selvbetaling.\",\"\")","v":{"$error":"#REF!"}}]
[]
[]
[null,"Estimeret VEU-godtgørelse",null,{"$f":"D43+D25","v":0}]
[]
[null,"Selvbetaling i kr. (udgifter udover den øvre tilsagnsramme)",null,{"$f":"IF(C51>300,0,MAX(D49+D54+D44+D42+D24+D26-D56,0))","v":{"$error":"#REF!"}}]
[]
[null,"Tilsagnsbeløb i kr.",null,{"$f":"Slutregnskab!J10","v":{"$error":"#REF!"}}]

{"sheet":"Medarbejder 20","index":21,"n_rows":63,"n_cols":6,"rows_kept":63,"cut":false,"hidden":true,"merged":[[62,1,62,2],[60,1,60,2],[16,1,16,2],[33,1,33,2],[58,1,58,2],[46,1,46,2],[34,1,34,2],[22,1,22,2],[23,1,23,2],[24,1,24,2],[25,1,25,2],[27,1,27,2],[28,1,28,2],[29,1,29,2],[30,1,30,2],[31,1,31,2],[8,4,8,5],[21,1,21,2],[9,1,9,2],[9,4,9,5],[10,1,10,2],[11,1,11,3],[12,1,12,3],[14,1,14,3],[17,1,17,2],[18,1,18,2],[19,1,19,2],[20,1,20,2],[1,1,1,3],[3,1,3,3],[5,1,5,2],[6,1,6,2],[8,1,8,2],[7,1,7,2],[32,1,32,2],[48,1,48,2],[55,1,56,2],[55,3,56,3],[47,1,47,2],[35,1,35,2],[36,1,36,2],[37,1,37,2],[38,1,38,2],[39,1,39,2],[40,1,40,2],[41,1,41,2],[42,1,42,2],[43,1,43,2],[45,1,45,2]]}
[]
[null,"Slutregnskab for sporskiftepakken"]
[]
[null,"Oplysninger om medarbejderen"]
[]
[null,"Medarbejderens navn"]
[null,"Medarbejderens lønkompensation fra sporskifte (kr./t.)",null,{"$f":"IF(D8>261,(IF(D11=\"Ja\",260-'Format ark'!D13,260)),IF(D8<=260,IF(D11=\"Ja\",IF(D8<'Format ark'!D13,0,D8-'Format ark'!D13),D8)))","v":0}]
[null,"Medarbejderens timesats (kr./t.)"]
[null,"Medarbejderens højst gennemførte uddannelse",null,null,{"$f":"IF(D9=\"\",\"Husk at vælge medarbejderens højst gennemførte uddannelse.\",\" \")","v":"Husk at vælge medarbejderens højst gennemførte uddannelse."}]
[null,"Har medarbejderen brugt sin uddannelse de senest 5 år?",null,null,{"$f":"IF(D10=\"\",\"Husk at svare på spørgsmålet.\",\" \")","v":"Husk at svare på spørgsmålet."}]
[null,"Medarbejder formodes at være berettiget til at få VEU-godtgørelse ",null,{"$f":"IF(OR(D9=\"Videregående uddannelse\",D9=\"Gymnasial uddannelse\")*AND(D10=\"ja\"),\"Nej\",\"Ja\")","v":"Ja"}]
[null,"Beskriv herunder hvad formålet med den planlagte sporskiftepakke er for medarbejderen:"]
[]
[]
[null,"Aktiviteter"]
[]
[null,"Afklaring, vejledning mv. \nSkriv navn på kursus",null,"Medarbejderens timeforbug (timer)","Evt. deltagerbetaling (kr.)","Giver kurset ret til VEU-godtgørelse?"]
[]
[]
[]
[]
[]
[null,"Samlet antal timer (udregner selv)",null,{"$f":"SUM(D18:D22)","v":0}]
[null,"Samlet lønkompensation udover evt. VEU-godtgørelse (udregner selv)",null,{"$f":"IF(D11=\"Nej\",D23*D7,0)+IF(AND(D11=\"Ja\",F18=\"Ja\"),D18*D7,0)+IF(AND(D11=\"Ja\",F19=\"Ja\"),D19*D7,0)+IF(AND(D11=\"Ja\",F20=\"Ja\"),D20*D7,0)+IF(AND(D11=\"Ja\",F21=\"Ja\"),D21*D7,0)+IF(AND(D11=\"Ja\",F22=\"Ja\"),D22*D7,0)+IF(AND(D11=\"Ja\",F18=\"Nej\"),D18*IF(D8>261,(IF(F18=\"Ja\",260-'Format ark'!D13,260)),IF(D8<=260,IF(F18=\"Ja\",D8-'Format ark'!D13,D8))),0)+IF(AND(D11=\"Ja\",F19=\"Nej\"),D19*IF(D8>261,(IF(F19=\"Ja\",260-'Format ark'!D13,260)),IF(D8<=260,IF(F19=\"Ja\",D8-'Format ark'!D13,D8))),0)+IF(AND(D11=\"Ja\",F20=\"Nej\"),D20*IF(D8>261,(IF(F20=\"Ja\",260-'Format ark'!D13,260)),IF(D8<=260,IF(F20=\"Ja\",D8-'Format ark'!D13,D8))),0)+IF(AND(D11=\"Ja\",F21=\"Nej\"),D21*IF(D8>261,(IF(F21=\"Ja\",260-'Format ark'!D13,260)),IF(D8<=260,IF(F21=\"Ja\",D8-'Format ark'!D13,D8))),0)+IF(AND(D11=\"Ja\",F22=\"Nej\"),D22*IF(D8>261,(IF(F22=\"Ja\",260-'Format ark'!D13,260)),IF(D8<=260,IF(F22=\"Ja\",D8-'Format ark'!D13,D8))),0)","v":0}]
[null,"Estimeret VEU-godtgørelse",null,{"$f":"IF(AND(D11=\"Ja\",F18=\"Ja\"),D18*'Format ark'!D13,0)+IF(AND(D11=\"Ja\",F19=\"Ja\"),D19*'Format ark'!D13,0)+IF(AND(D11=\"Ja\",F20=\"Ja\"),D20*'Format ark'!D13,0)+IF(AND(D11=\"Ja\",F21=\"Ja\"),D21*'Format ark'!D13,0)+IF(AND(D11=\"Ja\",F22=\"Ja\"),D22*'Format ark'!D13,0)","v":0}]
[null,"Samlet deltagerbeltaing (udregner selv)",null,{"$f":"SUM(E18:E22)","v":0}]
[]
[null,"Erhversrettet efteruddannelse\nSkriv navn på efteruddannelse",null,"Medarbejderens timeforbrug (timer)","Evt. deltagerbetaling (kr.)","Giver kurset ret til VEU-godtgørelse?"]
[]
[]
[]
[]
[]
[]
[]
[]
[]
[]
[]
[]
[null,"Samlet antal timer (udregner selv)",null,{"$f":"SUM(D29:D40)","v":0}]
[null,"Samlet lønkompensation udover evt. VEU-godtgørelse (udregner selv)",null,{"$f":"IF(D11=\"Nej\",D41*D7,0)+IF(AND(D11=\"Ja\",F29=\"Ja\"),D29*D7,0)+IF(AND(D11=\"Ja\",F30=\"Ja\"),D30*D7,0)+IF(AND(D11=\"Ja\",F31=\"Ja\"),D31*D7,0)+IF(AND(D11=\"Ja\",F32=\"Ja\"),D32*D7,0)+IF(AND(D11=\"Ja\",F33=\"Ja\"),D33*D7,0)+IF(AND(D11=\"Ja\",F34=\"Ja\"),D34*D7,0)+IF(AND(D11=\"Ja\",F35=\"Ja\"),D35*D7,0)+IF(AND(D11=\"Ja\",F36=\"Ja\"),D36*D7,0)+IF(AND(D11=\"Ja\",F37=\"Ja\"),D37*D7,0)+IF(AND(D11=\"Ja\",F38=\"Ja\"),D38*D7,0)+IF(AND(D11=\"Ja\",F39=\"Ja\"),D39*D7,0)+IF(AND(D11=\"Ja\",F40=\"Ja\"),D40*D7,0)+IF(AND(D11=\"Ja\",F29=\"Nej\"),D29* IF(D8>261,(IF(F29=\"Ja\",260-'Format ark'!D13,260)),IF(D8<=260,IF(F29=\"Ja\",D8-'Format ark'!D13,D8))),0)+IF(AND(D11=\"Ja\",F30=\"Nej\"),D30* IF(D8>261,(IF(F30=\"Ja\",260-'Format ark'!D13,260)),IF(D8<=260,IF(F30=\"Ja\",D8-'Format ark'!D13,D8))),0)+IF(AND(D11=\"Ja\",F31=\"Nej\"),D31* IF(D8>261,(IF(F31=\"Ja\",260-'Format ark'!D13,260)),IF(D8<=260,IF(F31=\"Ja\",D8-'Format ark'!D13,D8))),0)+IF(AND(D11=\"Ja\",F32=\"Nej\"),D32* IF(D8>261,(IF(F32=\"Ja\",260-'Format ark'!D13,260)),IF(D8<=260,IF(F32=\"Ja\",D8-'Format ark'!D13,D8))),0)+IF(AND(D11=\"Ja\",F33=\"Nej\"),D33* IF(D8>261,(IF(F33=\"Ja\",260-'Format ark'!D13,260)),IF(D8<=260,IF(F33=\"Ja\",D8-'Format ark'!D13,D8))),0)+IF(AND(D11=\"Ja\",F34=\"Nej\"),D34* IF(D8>261,(IF(F34=\"Ja\",260-'Format ark'!D13,260)),IF(D8<=260,IF(F34=\"Ja\",D8-'Format ark'!D13,D8))),0)+IF(AND(D11=\"Ja\",F35=\"Nej\"),D35* IF(D8>261,(IF(F35=\"Ja\",260-'Format ark'!D13,260)),IF(D8<=260,IF(F35=\"Ja\",D8-'Format ark'!D13,D8))),0)+IF(AND(D11=\"Ja\",F36=\"Nej\"),D36* IF(D8>261,(IF(F36=\"Ja\",260-'Format ark'!D13,260)),IF(D8<=260,IF(F36=\"Ja\",D8-'Format ark'!D13,D8))),0)+IF(AND(D11=\"Ja\",F37=\"Nej\"),D37* IF(D8>261,(IF(F37=\"Ja\",260-'Format ark'!D13,260)),IF(D8<=260,IF(F37=\"Ja\",D8-'Format ark'!D13,D8))),0)+IF(AND(D11=\"Ja\",F38=\"Nej\"),D38* IF(D8>261,(IF(F38=\"Ja\",260-'Format ark'!D13,260)),IF(D8<=260,IF(F38=\"Ja\",D8-'Format ark'!D13,D8))),0)+IF(AND(D11=\"Ja\",F39=\"Nej\"),D39* IF(D8>261,(IF(F39=\"Ja\",260-'Format ark'!D13,260)),IF(D8<=260,IF(F39=\"Ja\",D8-'Format ark'!D13,D8))),0)+IF(AND(D11=\"Ja\",F40=\"Nej\"),D40* IF(D8>261,(IF(F40=\"Ja\",260-'Format ark'!D13,260)),IF(D8<=260,IF(F40=\"Ja\",D8-'Format ark'!D13,D8))),0)","v":0}]
[null,"Estimeret VEU-godtgørelse",null,{"$f":"IF(AND(D11=\"Ja\",F29=\"Ja\"),D29*'Format ark'!D13,0)+IF(AND(D11=\"Ja\",F30=\"Ja\"),D30*'Format ark'!D13,0)+IF(AND(D11=\"Ja\",F31=\"Ja\"),D31*'Format ark'!D13,0)+IF(AND(D11=\"Ja\",F32=\"Ja\"),D32*('Format ark'!D13),0)+IF(AND(D11=\"Ja\",F33=\"Ja\"),D33*'Format ark'!D13,0)+IF(AND(D11=\"Ja\",F34=\"Ja\"),D34*'Format ark'!D13,0)+IF(AND(D11=\"Ja\",F35=\"Ja\"),D35*'Format ark'!D13,0)+IF(AND(D11=\"Ja\",F36=\"Ja\"),D36*'Format ark'!D13,0)+IF(AND(D11=\"Ja\",F37=\"Ja\"),D37*'Format ark'!D13,0)+IF(AND(D11=\"Ja\",F38=\"Ja\"),D38*'Format ark'!D13,0)+IF(AND(D11=\"Ja\",F39=\"Ja\"),D39*'Format ark'!D13,0)+IF(AND(D11=\"Ja\",F40=\"Ja\"),D40*'Format ark'!D13,0)","v":0}]
[null,"Samlet deltagerbetaling (udregner selv)",null,{"$f":"SUM(E29:E40)","v":0}]
[]
[null,"Praktik"]
[null,"Navn på virksomhed og p-nummer"]
[null,"Medarbejderens timeforbrug",null,null,{"$f":"IF(D48>C51*0.5,\"Praktik må maksimalt udgøre 50% af det samlede tidsforbrug.\",\" \")","v":" "}]
[null,"Samlet lønkompensation for praktikopholdet",null,{"$f":"IF(D48>C51*0.5,\"IKKE MULIGT\",D48*(IF(D8>261,260,D8)))","v":0}]
[]
[null,"Samlet tidsforbrug ",{"$f":"IF(D48+D41+D23>300,\"IKKE MULIGT\",D48+D41+D23)","v":0},{"$f":"IF(C51>300,\"Det maksimale tidsforbrug er 300 timer\",\" \")","v":" "}]
[]
[null,"Tidsforbrug til administration","Antal timer","Beløb"]
[null,"Der kan godtgøres op til 5 timer.",null,{"$f":"IF(C54>5,\"Der kan maksimalt godtgøres 5 timer pr. medarbejder.\",C54*260)","v":0}]
[]
[null,"Samlet tilsagnsramme i kr. (maksimal støtte til sporskiftepakken): ",null,{"$f":"IF(AND(C51>300,D49+D44+D42+D26+D24+D54<D63+1),0,MIN(D49+D44+D42+D26+D24+D54,120000))","v":{"$error":"#REF!"}},{"$f":"IF(D56=120000,\"Det maksimale tilsagn pr. sporskiftepakke er nået, og det overstigende beløb er derfor selvbetaling.\",\"\")","v":{"$error":"#REF!"}}]
[]
[]
[null,"Estimeret VEU-godtgørelse",null,{"$f":"D43+D25","v":0}]
[]
[null,"Selvbetaling i kr. (udgifter udover den øvre tilsagnsramme)",null,{"$f":"IF(C51>300,0,MAX(D49+D54+D44+D42+D24+D26-D56,0))","v":{"$error":"#REF!"}}]
[]
[null,"Tilsagnsbeløb i kr.",null,{"$f":"Slutregnskab!J10","v":{"$error":"#REF!"}}]

{"sheet":"Medarbejder 21","index":22,"n_rows":63,"n_cols":6,"rows_kept":63,"cut":false,"hidden":true,"merged":[[62,1,62,2],[60,1,60,2],[16,1,16,2],[33,1,33,2],[58,1,58,2],[46,1,46,2],[34,1,34,2],[22,1,22,2],[23,1,23,2],[24,1,24,2],[25,1,25,2],[27,1,27,2],[28,1,28,2],[29,1,29,2],[30,1,30,2],[31,1,31,2],[8,4,8,5],[21,1,21,2],[9,1,9,2],[9,4,9,5],[10,1,10,2],[11,1,11,3],[12,1,12,3],[14,1,14,3],[17,1,17,2],[18,1,18,2],[19,1,19,2],[20,1,20,2],[1,1,1,3],[3,1,3,3],[5,1,5,2],[6,1,6,2],[8,1,8,2],[7,1,7,2],[32,1,32,2],[48,1,48,2],[55,1,56,2],[55,3,56,3],[47,1,47,2],[35,1,35,2],[36,1,36,2],[37,1,37,2],[38,1,38,2],[39,1,39,2],[40,1,40,2],[41,1,41,2],[42,1,42,2],[43,1,43,2],[45,1,45,2]]}
[]
[null,"Slutregnskab for sporskiftepakken"]
[]
[null,"Oplysninger om medarbejderen"]
[]
[null,"Medarbejderens navn"]
[null,"Medarbejderens lønkompensation fra sporskifte (kr./t.)",null,{"$f":"IF(D8>261,(IF(D11=\"Ja\",260-'Format ark'!D13,260)),IF(D8<=260,IF(D11=\"Ja\",IF(D8<'Format ark'!D13,0,D8-'Format ark'!D13),D8)))","v":0}]
[null,"Medarbejderens timesats (kr./t.)"]
[null,"Medarbejderens højst gennemførte uddannelse",null,null,{"$f":"IF(D9=\"\",\"Husk at vælge medarbejderens højst gennemførte uddannelse.\",\" \")","v":"Husk at vælge medarbejderens højst gennemførte uddannelse."}]
[null,"Har medarbejderen brugt sin uddannelse de senest 5 år?",null,null,{"$f":"IF(D10=\"\",\"Husk at svare på spørgsmålet.\",\" \")","v":"Husk at svare på spørgsmålet."}]
[null,"Medarbejder formodes at være berettiget til at få VEU-godtgørelse ",null,{"$f":"IF(OR(D9=\"Videregående uddannelse\",D9=\"Gymnasial uddannelse\")*AND(D10=\"ja\"),\"Nej\",\"Ja\")","v":"Ja"}]
[null,"Beskriv herunder hvad formålet med den planlagte sporskiftepakke er for medarbejderen:"]
[]
[]
[null,"Aktiviteter"]
[]
[null,"Afklaring, vejledning mv. \nSkriv navn på kursus",null,"Medarbejderens timeforbug (timer)","Evt. deltagerbetaling (kr.)","Giver kurset ret til VEU-godtgørelse?"]
[]
[]
[]
[]
[]
[null,"Samlet antal timer (udregner selv)",null,{"$f":"SUM(D18:D22)","v":0}]
[null,"Samlet lønkompensation udover evt. VEU-godtgørelse (udregner selv)",null,{"$f":"IF(D11=\"Nej\",D23*D7,0)+IF(AND(D11=\"Ja\",F18=\"Ja\"),D18*D7,0)+IF(AND(D11=\"Ja\",F19=\"Ja\"),D19*D7,0)+IF(AND(D11=\"Ja\",F20=\"Ja\"),D20*D7,0)+IF(AND(D11=\"Ja\",F21=\"Ja\"),D21*D7,0)+IF(AND(D11=\"Ja\",F22=\"Ja\"),D22*D7,0)+IF(AND(D11=\"Ja\",F18=\"Nej\"),D18*IF(D8>261,(IF(F18=\"Ja\",260-'Format ark'!D13,260)),IF(D8<=260,IF(F18=\"Ja\",D8-'Format ark'!D13,D8))),0)+IF(AND(D11=\"Ja\",F19=\"Nej\"),D19*IF(D8>261,(IF(F19=\"Ja\",260-'Format ark'!D13,260)),IF(D8<=260,IF(F19=\"Ja\",D8-'Format ark'!D13,D8))),0)+IF(AND(D11=\"Ja\",F20=\"Nej\"),D20*IF(D8>261,(IF(F20=\"Ja\",260-'Format ark'!D13,260)),IF(D8<=260,IF(F20=\"Ja\",D8-'Format ark'!D13,D8))),0)+IF(AND(D11=\"Ja\",F21=\"Nej\"),D21*IF(D8>261,(IF(F21=\"Ja\",260-'Format ark'!D13,260)),IF(D8<=260,IF(F21=\"Ja\",D8-'Format ark'!D13,D8))),0)+IF(AND(D11=\"Ja\",F22=\"Nej\"),D22*IF(D8>261,(IF(F22=\"Ja\",260-'Format ark'!D13,260)),IF(D8<=260,IF(F22=\"Ja\",D8-'Format ark'!D13,D8))),0)","v":0}]
[null,"Estimeret VEU-godtgørelse",null,{"$f":"IF(AND(D11=\"Ja\",F18=\"Ja\"),D18*'Format ark'!D13,0)+IF(AND(D11=\"Ja\",F19=\"Ja\"),D19*'Format ark'!D13,0)+IF(AND(D11=\"Ja\",F20=\"Ja\"),D20*'Format ark'!D13,0)+IF(AND(D11=\"Ja\",F21=\"Ja\"),D21*'Format ark'!D13,0)+IF(AND(D11=\"Ja\",F22=\"Ja\"),D22*'Format ark'!D13,0)","v":0}]
[null,"Samlet deltagerbeltaing (udregner selv)",null,{"$f":"SUM(E18:E22)","v":0}]
[]
[null,"Erhversrettet efteruddannelse\nSkriv navn på efteruddannelse",null,"Medarbejderens timeforbrug (timer)","Evt. deltagerbetaling (kr.)","Giver kurset ret til VEU-godtgørelse?"]
[]
[]
[]
[]
[]
[]
[]
[]
[]
[]
[]
[]
[null,"Samlet antal timer (udregner selv)",null,{"$f":"SUM(D29:D40)","v":0}]
[null,"Samlet lønkompensation udover evt. VEU-godtgørelse (udregner selv)",null,{"$f":"IF(D11=\"Nej\",D41*D7,0)+IF(AND(D11=\"Ja\",F29=\"Ja\"),D29*D7,0)+IF(AND(D11=\"Ja\",F30=\"Ja\"),D30*D7,0)+IF(AND(D11=\"Ja\",F31=\"Ja\"),D31*D7,0)+IF(AND(D11=\"Ja\",F32=\"Ja\"),D32*D7,0)+IF(AND(D11=\"Ja\",F33=\"Ja\"),D33*D7,0)+IF(AND(D11=\"Ja\",F34=\"Ja\"),D34*D7,0)+IF(AND(D11=\"Ja\",F35=\"Ja\"),D35*D7,0)+IF(AND(D11=\"Ja\",F36=\"Ja\"),D36*D7,0)+IF(AND(D11=\"Ja\",F37=\"Ja\"),D37*D7,0)+IF(AND(D11=\"Ja\",F38=\"Ja\"),D38*D7,0)+IF(AND(D11=\"Ja\",F39=\"Ja\"),D39*D7,0)+IF(AND(D11=\"Ja\",F40=\"Ja\"),D40*D7,0)+IF(AND(D11=\"Ja\",F29=\"Nej\"),D29* IF(D8>261,(IF(F29=\"Ja\",260-'Format ark'!D13,260)),IF(D8<=260,IF(F29=\"Ja\",D8-'Format ark'!D13,D8))),0)+IF(AND(D11=\"Ja\",F30=\"Nej\"),D30* IF(D8>261,(IF(F30=\"Ja\",260-'Format ark'!D13,260)),IF(D8<=260,IF(F30=\"Ja\",D8-'Format ark'!D13,D8))),0)+IF(AND(D11=\"Ja\",F31=\"Nej\"),D31* IF(D8>261,(IF(F31=\"Ja\",260-'Format ark'!D13,260)),IF(D8<=260,IF(F31=\"Ja\",D8-'Format ark'!D13,D8))),0)+IF(AND(D11=\"Ja\",F32=\"Nej\"),D32* IF(D8>261,(IF(F32=\"Ja\",260-'Format ark'!D13,260)),IF(D8<=260,IF(F32=\"Ja\",D8-'Format ark'!D13,D8))),0)+IF(AND(D11=\"Ja\",F33=\"Nej\"),D33* IF(D8>261,(IF(F33=\"Ja\",260-'Format ark'!D13,260)),IF(D8<=260,IF(F33=\"Ja\",D8-'Format ark'!D13,D8))),0)+IF(AND(D11=\"Ja\",F34=\"Nej\"),D34* IF(D8>261,(IF(F34=\"Ja\",260-'Format ark'!D13,260)),IF(D8<=260,IF(F34=\"Ja\",D8-'Format ark'!D13,D8))),0)+IF(AND(D11=\"Ja\",F35=\"Nej\"),D35* IF(D8>261,(IF(F35=\"Ja\",260-'Format ark'!D13,260)),IF(D8<=260,IF(F35=\"Ja\",D8-'Format ark'!D13,D8))),0)+IF(AND(D11=\"Ja\",F36=\"Nej\"),D36* IF(D8>261,(IF(F36=\"Ja\",260-'Format ark'!D13,260)),IF(D8<=260,IF(F36=\"Ja\",D8-'Format ark'!D13,D8))),0)+IF(AND(D11=\"Ja\",F37=\"Nej\"),D37* IF(D8>261,(IF(F37=\"Ja\",260-'Format ark'!D13,260)),IF(D8<=260,IF(F37=\"Ja\",D8-'Format ark'!D13,D8))),0)+IF(AND(D11=\"Ja\",F38=\"Nej\"),D38* IF(D8>261,(IF(F38=\"Ja\",260-'Format ark'!D13,260)),IF(D8<=260,IF(F38=\"Ja\",D8-'Format ark'!D13,D8))),0)+IF(AND(D11=\"Ja\",F39=\"Nej\"),D39* IF(D8>261,(IF(F39=\"Ja\",260-'Format ark'!D13,260)),IF(D8<=260,IF(F39=\"Ja\",D8-'Format ark'!D13,D8))),0)+IF(AND(D11=\"Ja\",F40=\"Nej\"),D40* IF(D8>261,(IF(F40=\"Ja\",260-'Format ark'!D13,260)),IF(D8<=260,IF(F40=\"Ja\",D8-'Format ark'!D13,D8))),0)","v":0}]
[null,"Estimeret VEU-godtgørelse",null,{"$f":"IF(AND(D11=\"Ja\",F29=\"Ja\"),D29*'Format ark'!D13,0)+IF(AND(D11=\"Ja\",F30=\"Ja\"),D30*'Format ark'!D13,0)+IF(AND(D11=\"Ja\",F31=\"Ja\"),D31*'Format ark'!D13,0)+IF(AND(D11=\"Ja\",F32=\"Ja\"),D32*('Format ark'!D13),0)+IF(AND(D11=\"Ja\",F33=\"Ja\"),D33*'Format ark'!D13,0)+IF(AND(D11=\"Ja\",F34=\"Ja\"),D34*'Format ark'!D13,0)+IF(AND(D11=\"Ja\",F35=\"Ja\"),D35*'Format ark'!D13,0)+IF(AND(D11=\"Ja\",F36=\"Ja\"),D36*'Format ark'!D13,0)+IF(AND(D11=\"Ja\",F37=\"Ja\"),D37*'Format ark'!D13,0)+IF(AND(D11=\"Ja\",F38=\"Ja\"),D38*'Format ark'!D13,0)+IF(AND(D11=\"Ja\",F39=\"Ja\"),D39*'Format ark'!D13,0)+IF(AND(D11=\"Ja\",F40=\"Ja\"),D40*'Format ark'!D13,0)","v":0}]
[null,"Samlet deltagerbetaling (udregner selv)",null,{"$f":"SUM(E29:E40)","v":0}]
[]
[null,"Praktik"]
[null,"Navn på virksomhed og p-nummer"]
[null,"Medarbejderens timeforbrug",null,null,{"$f":"IF(D48>C51*0.5,\"Praktik må maksimalt udgøre 50% af det samlede tidsforbrug.\",\" \")","v":" "}]
[null,"Samlet lønkompensation for praktikopholdet",null,{"$f":"IF(D48>C51*0.5,\"IKKE MULIGT\",D48*(IF(D8>261,260,D8)))","v":0}]
[]
[null,"Samlet tidsforbrug ",{"$f":"IF(D48+D41+D23>300,\"IKKE MULIGT\",D48+D41+D23)","v":0},{"$f":"IF(C51>300,\"Det maksimale tidsforbrug er 300 timer\",\" \")","v":" "}]
[]
[null,"Tidsforbrug til administration","Antal timer","Beløb"]
[null,"Der kan godtgøres op til 5 timer.",null,{"$f":"IF(C54>5,\"Der kan maksimalt godtgøres 5 timer pr. medarbejder.\",C54*260)","v":0}]
[]
[null,"Samlet tilsagnsramme i kr. (maksimal støtte til sporskiftepakken): ",null,{"$f":"IF(AND(C51>300,D49+D44+D42+D26+D24+D54<D63+1),0,MIN(D49+D44+D42+D26+D24+D54,120000))","v":{"$error":"#REF!"}},{"$f":"IF(D56=120000,\"Det maksimale tilsagn pr. sporskiftepakke er nået, og det overstigende beløb er derfor selvbetaling.\",\"\")","v":{"$error":"#REF!"}}]
[]
[]
[null,"Estimeret VEU-godtgørelse",null,{"$f":"D43+D25","v":0}]
[]
[null,"Selvbetaling i kr. (udgifter udover den øvre tilsagnsramme)",null,{"$f":"IF(C51>300,0,MAX(D49+D54+D44+D42+D24+D26-D56,0))","v":{"$error":"#REF!"}}]
[]
[null,"Tilsagnsbeløb i kr.",null,{"$f":"Slutregnskab!J10","v":{"$error":"#REF!"}}]

{"sheet":"Medarbejder 22","index":23,"n_rows":63,"n_cols":6,"rows_kept":63,"cut":false,"hidden":true,"merged":[[62,1,62,2],[60,1,60,2],[16,1,16,2],[33,1,33,2],[58,1,58,2],[46,1,46,2],[34,1,34,2],[22,1,22,2],[23,1,23,2],[24,1,24,2],[25,1,25,2],[27,1,27,2],[28,1,28,2],[29,1,29,2],[30,1,30,2],[31,1,31,2],[8,4,8,5],[21,1,21,2],[9,1,9,2],[9,4,9,5],[10,1,10,2],[11,1,11,3],[12,1,12,3],[14,1,14,3],[17,1,17,2],[18,1,18,2],[19,1,19,2],[20,1,20,2],[1,1,1,3],[3,1,3,3],[5,1,5,2],[6,1,6,2],[8,1,8,2],[7,1,7,2],[32,1,32,2],[48,1,48,2],[55,1,56,2],[55,3,56,3],[47,1,47,2],[35,1,35,2],[36,1,36,2],[37,1,37,2],[38,1,38,2],[39,1,39,2],[40,1,40,2],[41,1,41,2],[42,1,42,2],[43,1,43,2],[45,1,45,2]]}
[]
[null,"Slutregnskab for sporskiftepakken"]
[]
[null,"Oplysninger om medarbejderen"]
[]
[null,"Medarbejderens navn"]
[null,"Medarbejderens lønkompensation fra sporskifte (kr./t.)",null,{"$f":"IF(D8>261,(IF(D11=\"Ja\",260-'Format ark'!D13,260)),IF(D8<=260,IF(D11=\"Ja\",IF(D8<'Format ark'!D13,0,D8-'Format ark'!D13),D8)))","v":0}]
[null,"Medarbejderens timesats (kr./t.)"]
[null,"Medarbejderens højst gennemførte uddannelse",null,null,{"$f":"IF(D9=\"\",\"Husk at vælge medarbejderens højst gennemførte uddannelse.\",\" \")","v":"Husk at vælge medarbejderens højst gennemførte uddannelse."}]
[null,"Har medarbejderen brugt sin uddannelse de senest 5 år?",null,null,{"$f":"IF(D10=\"\",\"Husk at svare på spørgsmålet.\",\" \")","v":"Husk at svare på spørgsmålet."}]
[null,"Medarbejder formodes at være berettiget til at få VEU-godtgørelse ",null,{"$f":"IF(OR(D9=\"Videregående uddannelse\",D9=\"Gymnasial uddannelse\")*AND(D10=\"ja\"),\"Nej\",\"Ja\")","v":"Ja"}]
[null,"Beskriv herunder hvad formålet med den planlagte sporskiftepakke er for medarbejderen:"]
[]
[]
[null,"Aktiviteter"]
[]
[null,"Afklaring, vejledning mv. \nSkriv navn på kursus",null,"Medarbejderens timeforbug (timer)","Evt. deltagerbetaling (kr.)","Giver kurset ret til VEU-godtgørelse?"]
[]
[]
[]
[]
[]
[null,"Samlet antal timer (udregner selv)",null,{"$f":"SUM(D18:D22)","v":0}]
[null,"Samlet lønkompensation udover evt. VEU-godtgørelse (udregner selv)",null,{"$f":"IF(D11=\"Nej\",D23*D7,0)+IF(AND(D11=\"Ja\",F18=\"Ja\"),D18*D7,0)+IF(AND(D11=\"Ja\",F19=\"Ja\"),D19*D7,0)+IF(AND(D11=\"Ja\",F20=\"Ja\"),D20*D7,0)+IF(AND(D11=\"Ja\",F21=\"Ja\"),D21*D7,0)+IF(AND(D11=\"Ja\",F22=\"Ja\"),D22*D7,0)+IF(AND(D11=\"Ja\",F18=\"Nej\"),D18*IF(D8>261,(IF(F18=\"Ja\",260-'Format ark'!D13,260)),IF(D8<=260,IF(F18=\"Ja\",D8-'Format ark'!D13,D8))),0)+IF(AND(D11=\"Ja\",F19=\"Nej\"),D19*IF(D8>261,(IF(F19=\"Ja\",260-'Format ark'!D13,260)),IF(D8<=260,IF(F19=\"Ja\",D8-'Format ark'!D13,D8))),0)+IF(AND(D11=\"Ja\",F20=\"Nej\"),D20*IF(D8>261,(IF(F20=\"Ja\",260-'Format ark'!D13,260)),IF(D8<=260,IF(F20=\"Ja\",D8-'Format ark'!D13,D8))),0)+IF(AND(D11=\"Ja\",F21=\"Nej\"),D21*IF(D8>261,(IF(F21=\"Ja\",260-'Format ark'!D13,260)),IF(D8<=260,IF(F21=\"Ja\",D8-'Format ark'!D13,D8))),0)+IF(AND(D11=\"Ja\",F22=\"Nej\"),D22*IF(D8>261,(IF(F22=\"Ja\",260-'Format ark'!D13,260)),IF(D8<=260,IF(F22=\"Ja\",D8-'Format ark'!D13,D8))),0)","v":0}]
[null,"Estimeret VEU-godtgørelse",null,{"$f":"IF(AND(D11=\"Ja\",F18=\"Ja\"),D18*'Format ark'!D13,0)+IF(AND(D11=\"Ja\",F19=\"Ja\"),D19*'Format ark'!D13,0)+IF(AND(D11=\"Ja\",F20=\"Ja\"),D20*'Format ark'!D13,0)+IF(AND(D11=\"Ja\",F21=\"Ja\"),D21*'Format ark'!D13,0)+IF(AND(D11=\"Ja\",F22=\"Ja\"),D22*'Format ark'!D13,0)","v":0}]
[null,"Samlet deltagerbeltaing (udregner selv)",null,{"$f":"SUM(E18:E22)","v":0}]
[]
[null,"Erhversrettet efteruddannelse\nSkriv navn på efteruddannelse",null,"Medarbejderens timeforbrug (timer)","Evt. deltagerbetaling (kr.)","Giver kurset ret til VEU-godtgørelse?"]
[]
[]
[]
[]
[]
[]
[]
[]
[]
[]
[]
[]
[null,"Samlet antal timer (udregner selv)",null,{"$f":"SUM(D29:D40)","v":0}]
[null,"Samlet lønkompensation udover evt. VEU-godtgørelse (udregner selv)",null,{"$f":"IF(D11=\"Nej\",D41*D7,0)+IF(AND(D11=\"Ja\",F29=\"Ja\"),D29*D7,0)+IF(AND(D11=\"Ja\",F30=\"Ja\"),D30*D7,0)+IF(AND(D11=\"Ja\",F31=\"Ja\"),D31*D7,0)+IF(AND(D11=\"Ja\",F32=\"Ja\"),D32*D7,0)+IF(AND(D11=\"Ja\",F33=\"Ja\"),D33*D7,0)+IF(AND(D11=\"Ja\",F34=\"Ja\"),D34*D7,0)+IF(AND(D11=\"Ja\",F35=\"Ja\"),D35*D7,0)+IF(AND(D11=\"Ja\",F36=\"Ja\"),D36*D7,0)+IF(AND(D11=\"Ja\",F37=\"Ja\"),D37*D7,0)+IF(AND(D11=\"Ja\",F38=\"Ja\"),D38*D7,0)+IF(AND(D11=\"Ja\",F39=\"Ja\"),D39*D7,0)+IF(AND(D11=\"Ja\",F40=\"Ja\"),D40*D7,0)+IF(AND(D11=\"Ja\",F29=\"Nej\"),D29* IF(D8>261,(IF(F29=\"Ja\",260-'Format ark'!D13,260)),IF(D8<=260,IF(F29=\"Ja\",D8-'Format ark'!D13,D8))),0)+IF(AND(D11=\"Ja\",F30=\"Nej\"),D30* IF(D8>261,(IF(F30=\"Ja\",260-'Format ark'!D13,260)),IF(D8<=260,IF(F30=\"Ja\",D8-'Format ark'!D13,D8))),0)+IF(AND(D11=\"Ja\",F31=\"Nej\"),D31* IF(D8>261,(IF(F31=\"Ja\",260-'Format ark'!D13,260)),IF(D8<=260,IF(F31=\"Ja\",D8-'Format ark'!D13,D8))),0)+IF(AND(D11=\"Ja\",F32=\"Nej\"),D32* IF(D8>261,(IF(F32=\"Ja\",260-'Format ark'!D13,260)),IF(D8<=260,IF(F32=\"Ja\",D8-'Format ark'!D13,D8))),0)+IF(AND(D11=\"Ja\",F33=\"Nej\"),D33* IF(D8>261,(IF(F33=\"Ja\",260-'Format ark'!D13,260)),IF(D8<=260,IF(F33=\"Ja\",D8-'Format ark'!D13,D8))),0)+IF(AND(D11=\"Ja\",F34=\"Nej\"),D34* IF(D8>261,(IF(F34=\"Ja\",260-'Format ark'!D13,260)),IF(D8<=260,IF(F34=\"Ja\",D8-'Format ark'!D13,D8))),0)+IF(AND(D11=\"Ja\",F35=\"Nej\"),D35* IF(D8>261,(IF(F35=\"Ja\",260-'Format ark'!D13,260)),IF(D8<=260,IF(F35=\"Ja\",D8-'Format ark'!D13,D8))),0)+IF(AND(D11=\"Ja\",F36=\"Nej\"),D36* IF(D8>261,(IF(F36=\"Ja\",260-'Format ark'!D13,260)),IF(D8<=260,IF(F36=\"Ja\",D8-'Format ark'!D13,D8))),0)+IF(AND(D11=\"Ja\",F37=\"Nej\"),D37* IF(D8>261,(IF(F37=\"Ja\",260-'Format ark'!D13,260)),IF(D8<=260,IF(F37=\"Ja\",D8-'Format ark'!D13,D8))),0)+IF(AND(D11=\"Ja\",F38=\"Nej\"),D38* IF(D8>261,(IF(F38=\"Ja\",260-'Format ark'!D13,260)),IF(D8<=260,IF(F38=\"Ja\",D8-'Format ark'!D13,D8))),0)+IF(AND(D11=\"Ja\",F39=\"Nej\"),D39* IF(D8>261,(IF(F39=\"Ja\",260-'Format ark'!D13,260)),IF(D8<=260,IF(F39=\"Ja\",D8-'Format ark'!D13,D8))),0)+IF(AND(D11=\"Ja\",F40=\"Nej\"),D40* IF(D8>261,(IF(F40=\"Ja\",260-'Format ark'!D13,260)),IF(D8<=260,IF(F40=\"Ja\",D8-'Format ark'!D13,D8))),0)","v":0}]
[null,"Estimeret VEU-godtgørelse",null,{"$f":"IF(AND(D11=\"Ja\",F29=\"Ja\"),D29*'Format ark'!D13,0)+IF(AND(D11=\"Ja\",F30=\"Ja\"),D30*'Format ark'!D13,0)+IF(AND(D11=\"Ja\",F31=\"Ja\"),D31*'Format ark'!D13,0)+IF(AND(D11=\"Ja\",F32=\"Ja\"),D32*('Format ark'!D13),0)+IF(AND(D11=\"Ja\",F33=\"Ja\"),D33*'Format ark'!D13,0)+IF(AND(D11=\"Ja\",F34=\"Ja\"),D34*'Format ark'!D13,0)+IF(AND(D11=\"Ja\",F35=\"Ja\"),D35*'Format ark'!D13,0)+IF(AND(D11=\"Ja\",F36=\"Ja\"),D36*'Format ark'!D13,0)+IF(AND(D11=\"Ja\",F37=\"Ja\"),D37*'Format ark'!D13,0)+IF(AND(D11=\"Ja\",F38=\"Ja\"),D38*'Format ark'!D13,0)+IF(AND(D11=\"Ja\",F39=\"Ja\"),D39*'Format ark'!D13,0)+IF(AND(D11=\"Ja\",F40=\"Ja\"),D40*'Format ark'!D13,0)","v":0}]
[null,"Samlet deltagerbetaling (udregner selv)",null,{"$f":"SUM(E29:E40)","v":0}]
[]
[null,"Praktik"]
[null,"Navn på virksomhed og p-nummer"]
[null,"Medarbejderens timeforbrug",null,null,{"$f":"IF(D48>C51*0.5,\"Praktik må maksimalt udgøre 50% af det samlede tidsforbrug.\",\" \")","v":" "}]
[null,"Samlet lønkompensation for praktikopholdet",null,{"$f":"IF(D48>C51*0.5,\"IKKE MULIGT\",D48*(IF(D8>261,260,D8)))","v":0}]
[]
[null,"Samlet tidsforbrug ",{"$f":"IF(D48+D41+D23>300,\"IKKE MULIGT\",D48+D41+D23)","v":0},{"$f":"IF(C51>300,\"Det maksimale tidsforbrug er 300 timer\",\" \")","v":" "}]
[]
[null,"Tidsforbrug til administration","Antal timer","Beløb"]
[null,"Der kan godtgøres op til 5 timer.",null,{"$f":"IF(C54>5,\"Der kan maksimalt godtgøres 5 timer pr. medarbejder.\",C54*260)","v":0}]
[]
[null,"Samlet tilsagnsramme i kr. (maksimal støtte til sporskiftepakken): ",null,{"$f":"IF(AND(C51>300,D49+D44+D42+D26+D24+D54<D63+1),0,MIN(D49+D44+D42+D26+D24+D54,120000))","v":{"$error":"#REF!"}},{"$f":"IF(D56=120000,\"Det maksimale tilsagn pr. sporskiftepakke er nået, og det overstigende beløb er derfor selvbetaling.\",\"\")","v":{"$error":"#REF!"}}]
[]
[]
[null,"Estimeret VEU-godtgørelse",null,{"$f":"D43+D25","v":0}]
[]
[null,"Selvbetaling i kr. (udgifter udover den øvre tilsagnsramme)",null,{"$f":"IF(C51>300,0,MAX(D49+D54+D44+D42+D24+D26-D56,0))","v":{"$error":"#REF!"}}]
[]
[null,"Tilsagnsbeløb i kr.",null,{"$f":"Slutregnskab!J10","v":{"$error":"#REF!"}}]

{"sheet":"Medarbejder 23","index":24,"n_rows":63,"n_cols":6,"rows_kept":63,"cut":false,"hidden":true,"merged":[[62,1,62,2],[60,1,60,2],[16,1,16,2],[33,1,33,2],[58,1,58,2],[46,1,46,2],[34,1,34,2],[22,1,22,2],[23,1,23,2],[24,1,24,2],[25,1,25,2],[27,1,27,2],[28,1,28,2],[29,1,29,2],[30,1,30,2],[31,1,31,2],[8,4,8,5],[21,1,21,2],[9,1,9,2],[9,4,9,5],[10,1,10,2],[11,1,11,3],[12,1,12,3],[14,1,14,3],[17,1,17,2],[18,1,18,2],[19,1,19,2],[20,1,20,2],[1,1,1,3],[3,1,3,3],[5,1,5,2],[6,1,6,2],[8,1,8,2],[7,1,7,2],[32,1,32,2],[48,1,48,2],[55,1,56,2],[55,3,56,3],[47,1,47,2],[35,1,35,2],[36,1,36,2],[37,1,37,2],[38,1,38,2],[39,1,39,2],[40,1,40,2],[41,1,41,2],[42,1,42,2],[43,1,43,2],[45,1,45,2]]}
[]
[null,"Slutregnskab for sporskiftepakken"]
[]
[null,"Oplysninger om medarbejderen"]
[]
[null,"Medarbejderens navn"]
[null,"Medarbejderens lønkompensation fra sporskifte (kr./t.)",null,{"$f":"IF(D8>261,(IF(D11=\"Ja\",260-'Format ark'!D13,260)),IF(D8<=260,IF(D11=\"Ja\",IF(D8<'Format ark'!D13,0,D8-'Format ark'!D13),D8)))","v":0}]
[null,"Medarbejderens timesats (kr./t.)"]
[null,"Medarbejderens højst gennemførte uddannelse",null,null,{"$f":"IF(D9=\"\",\"Husk at vælge medarbejderens højst gennemførte uddannelse.\",\" \")","v":"Husk at vælge medarbejderens højst gennemførte uddannelse."}]
[null,"Har medarbejderen brugt sin uddannelse de senest 5 år?",null,null,{"$f":"IF(D10=\"\",\"Husk at svare på spørgsmålet.\",\" \")","v":"Husk at svare på spørgsmålet."}]
[null,"Medarbejder formodes at være berettiget til at få VEU-godtgørelse ",null,{"$f":"IF(OR(D9=\"Videregående uddannelse\",D9=\"Gymnasial uddannelse\")*AND(D10=\"ja\"),\"Nej\",\"Ja\")","v":"Ja"}]
[null,"Beskriv herunder hvad formålet med den planlagte sporskiftepakke er for medarbejderen:"]
[]
[]
[null,"Aktiviteter"]
[]
[null,"Afklaring, vejledning mv. \nSkriv navn på kursus",null,"Medarbejderens timeforbug (timer)","Evt. deltagerbetaling (kr.)","Giver kurset ret til VEU-godtgørelse?"]
[]
[]
[]
[]
[]
[null,"Samlet antal timer (udregner selv)",null,{"$f":"SUM(D18:D22)","v":0}]
[null,"Samlet lønkompensation udover evt. VEU-godtgørelse (udregner selv)",null,{"$f":"IF(D11=\"Nej\",D23*D7,0)+IF(AND(D11=\"Ja\",F18=\"Ja\"),D18*D7,0)+IF(AND(D11=\"Ja\",F19=\"Ja\"),D19*D7,0)+IF(AND(D11=\"Ja\",F20=\"Ja\"),D20*D7,0)+IF(AND(D11=\"Ja\",F21=\"Ja\"),D21*D7,0)+IF(AND(D11=\"Ja\",F22=\"Ja\"),D22*D7,0)+IF(AND(D11=\"Ja\",F18=\"Nej\"),D18*IF(D8>261,(IF(F18=\"Ja\",260-'Format ark'!D13,260)),IF(D8<=260,IF(F18=\"Ja\",D8-'Format ark'!D13,D8))),0)+IF(AND(D11=\"Ja\",F19=\"Nej\"),D19*IF(D8>261,(IF(F19=\"Ja\",260-'Format ark'!D13,260)),IF(D8<=260,IF(F19=\"Ja\",D8-'Format ark'!D13,D8))),0)+IF(AND(D11=\"Ja\",F20=\"Nej\"),D20*IF(D8>261,(IF(F20=\"Ja\",260-'Format ark'!D13,260)),IF(D8<=260,IF(F20=\"Ja\",D8-'Format ark'!D13,D8))),0)+IF(AND(D11=\"Ja\",F21=\"Nej\"),D21*IF(D8>261,(IF(F21=\"Ja\",260-'Format ark'!D13,260)),IF(D8<=260,IF(F21=\"Ja\",D8-'Format ark'!D13,D8))),0)+IF(AND(D11=\"Ja\",F22=\"Nej\"),D22*IF(D8>261,(IF(F22=\"Ja\",260-'Format ark'!D13,260)),IF(D8<=260,IF(F22=\"Ja\",D8-'Format ark'!D13,D8))),0)","v":0}]
[null,"Estimeret VEU-godtgørelse",null,{"$f":"IF(AND(D11=\"Ja\",F18=\"Ja\"),D18*'Format ark'!D13,0)+IF(AND(D11=\"Ja\",F19=\"Ja\"),D19*'Format ark'!D13,0)+IF(AND(D11=\"Ja\",F20=\"Ja\"),D20*'Format ark'!D13,0)+IF(AND(D11=\"Ja\",F21=\"Ja\"),D21*'Format ark'!D13,0)+IF(AND(D11=\"Ja\",F22=\"Ja\"),D22*'Format ark'!D13,0)","v":0}]
[null,"Samlet deltagerbeltaing (udregner selv)",null,{"$f":"SUM(E18:E22)","v":0}]
[]
[null,"Erhversrettet efteruddannelse\nSkriv navn på efteruddannelse",null,"Medarbejderens timeforbrug (timer)","Evt. deltagerbetaling (kr.)","Giver kurset ret til VEU-godtgørelse?"]
[]
[]
[]
[]
[]
[]
[]
[]
[]
[]
[]
[]
[null,"Samlet antal timer (udregner selv)",null,{"$f":"SUM(D29:D40)","v":0}]
[null,"Samlet lønkompensation udover evt. VEU-godtgørelse (udregner selv)",null,{"$f":"IF(D11=\"Nej\",D41*D7,0)+IF(AND(D11=\"Ja\",F29=\"Ja\"),D29*D7,0)+IF(AND(D11=\"Ja\",F30=\"Ja\"),D30*D7,0)+IF(AND(D11=\"Ja\",F31=\"Ja\"),D31*D7,0)+IF(AND(D11=\"Ja\",F32=\"Ja\"),D32*D7,0)+IF(AND(D11=\"Ja\",F33=\"Ja\"),D33*D7,0)+IF(AND(D11=\"Ja\",F34=\"Ja\"),D34*D7,0)+IF(AND(D11=\"Ja\",F35=\"Ja\"),D35*D7,0)+IF(AND(D11=\"Ja\",F36=\"Ja\"),D36*D7,0)+IF(AND(D11=\"Ja\",F37=\"Ja\"),D37*D7,0)+IF(AND(D11=\"Ja\",F38=\"Ja\"),D38*D7,0)+IF(AND(D11=\"Ja\",F39=\"Ja\"),D39*D7,0)+IF(AND(D11=\"Ja\",F40=\"Ja\"),D40*D7,0)+IF(AND(D11=\"Ja\",F29=\"Nej\"),D29* IF(D8>261,(IF(F29=\"Ja\",260-'Format ark'!D13,260)),IF(D8<=260,IF(F29=\"Ja\",D8-'Format ark'!D13,D8))),0)+IF(AND(D11=\"Ja\",F30=\"Nej\"),D30* IF(D8>261,(IF(F30=\"Ja\",260-'Format ark'!D13,260)),IF(D8<=260,IF(F30=\"Ja\",D8-'Format ark'!D13,D8))),0)+IF(AND(D11=\"Ja\",F31=\"Nej\"),D31* IF(D8>261,(IF(F31=\"Ja\",260-'Format ark'!D13,260)),IF(D8<=260,IF(F31=\"Ja\",D8-'Format ark'!D13,D8))),0)+IF(AND(D11=\"Ja\",F32=\"Nej\"),D32* IF(D8>261,(IF(F32=\"Ja\",260-'Format ark'!D13,260)),IF(D8<=260,IF(F32=\"Ja\",D8-'Format ark'!D13,D8))),0)+IF(AND(D11=\"Ja\",F33=\"Nej\"),D33* IF(D8>261,(IF(F33=\"Ja\",260-'Format ark'!D13,260)),IF(D8<=260,IF(F33=\"Ja\",D8-'Format ark'!D13,D8))),0)+IF(AND(D11=\"Ja\",F34=\"Nej\"),D34* IF(D8>261,(IF(F34=\"Ja\",260-'Format ark'!D13,260)),IF(D8<=260,IF(F34=\"Ja\",D8-'Format ark'!D13,D8))),0)+IF(AND(D11=\"Ja\",F35=\"Nej\"),D35* IF(D8>261,(IF(F35=\"Ja\",260-'Format ark'!D13,260)),IF(D8<=260,IF(F35=\"Ja\",D8-'Format ark'!D13,D8))),0)+IF(AND(D11=\"Ja\",F36=\"Nej\"),D36* IF(D8>261,(IF(F36=\"Ja\",260-'Format ark'!D13,260)),IF(D8<=260,IF(F36=\"Ja\",D8-'Format ark'!D13,D8))),0)+IF(AND(D11=\"Ja\",F37=\"Nej\"),D37* IF(D8>261,(IF(F37=\"Ja\",260-'Format ark'!D13,260)),IF(D8<=260,IF(F37=\"Ja\",D8-'Format ark'!D13,D8))),0)+IF(AND(D11=\"Ja\",F38=\"Nej\"),D38* IF(D8>261,(IF(F38=\"Ja\",260-'Format ark'!D13,260)),IF(D8<=260,IF(F38=\"Ja\",D8-'Format ark'!D13,D8))),0)+IF(AND(D11=\"Ja\",F39=\"Nej\"),D39* IF(D8>261,(IF(F39=\"Ja\",260-'Format ark'!D13,260)),IF(D8<=260,IF(F39=\"Ja\",D8-'Format ark'!D13,D8))),0)+IF(AND(D11=\"Ja\",F40=\"Nej\"),D40* IF(D8>261,(IF(F40=\"Ja\",260-'Format ark'!D13,260)),IF(D8<=260,IF(F40=\"Ja\",D8-'Format ark'!D13,D8))),0)","v":0}]
[null,"Estimeret VEU-godtgørelse",null,{"$f":"IF(AND(D11=\"Ja\",F29=\"Ja\"),D29*'Format ark'!D13,0)+IF(AND(D11=\"Ja\",F30=\"Ja\"),D30*'Format ark'!D13,0)+IF(AND(D11=\"Ja\",F31=\"Ja\"),D31*'Format ark'!D13,0)+IF(AND(D11=\"Ja\",F32=\"Ja\"),D32*('Format ark'!D13),0)+IF(AND(D11=\"Ja\",F33=\"Ja\"),D33*'Format ark'!D13,0)+IF(AND(D11=\"Ja\",F34=\"Ja\"),D34*'Format ark'!D13,0)+IF(AND(D11=\"Ja\",F35=\"Ja\"),D35*'Format ark'!D13,0)+IF(AND(D11=\"Ja\",F36=\"Ja\"),D36*'Format ark'!D13,0)+IF(AND(D11=\"Ja\",F37=\"Ja\"),D37*'Format ark'!D13,0)+IF(AND(D11=\"Ja\",F38=\"Ja\"),D38*'Format ark'!D13,0)+IF(AND(D11=\"Ja\",F39=\"Ja\"),D39*'Format ark'!D13,0)+IF(AND(D11=\"Ja\",F40=\"Ja\"),D40*'Format ark'!D13,0)","v":0}]
[null,"Samlet deltagerbetaling (udregner selv)",null,{"$f":"SUM(E29:E40)","v":0}]
[]
[null,"Praktik"]
[null,"Navn på virksomhed og p-nummer"]
[null,"Medarbejderens timeforbrug",null,null,{"$f":"IF(D48>C51*0.5,\"Praktik må maksimalt udgøre 50% af det samlede tidsforbrug.\",\" \")","v":" "}]
[null,"Samlet lønkompensation for praktikopholdet",null,{"$f":"IF(D48>C51*0.5,\"IKKE MULIGT\",D48*(IF(D8>261,260,D8)))","v":0}]
[]
[null,"Samlet tidsforbrug ",{"$f":"IF(D48+D41+D23>300,\"IKKE MULIGT\",D48+D41+D23)","v":0},{"$f":"IF(C51>300,\"Det maksimale tidsforbrug er 300 timer\",\" \")","v":" "}]
[]
[null,"Tidsforbrug til administration","Antal timer","Beløb"]
[null,"Der kan godtgøres op til 5 timer.",null,{"$f":"IF(C54>5,\"Der kan maksimalt godtgøres 5 timer pr. medarbejder.\",C54*260)","v":0}]
[]
[null,"Samlet tilsagnsramme i kr. (maksimal støtte til sporskiftepakken): ",null,{"$f":"IF(AND(C51>300,D49+D44+D42+D26+D24+D54<D63+1),0,MIN(D49+D44+D42+D26+D24+D54,120000))","v":{"$error":"#REF!"}},{"$f":"IF(D56=120000,\"Det maksimale tilsagn pr. sporskiftepakke er nået, og det overstigende beløb er derfor selvbetaling.\",\"\")","v":{"$error":"#REF!"}}]
[]
[]
[null,"Estimeret VEU-godtgørelse",null,{"$f":"D43+D25","v":0}]
[]
[null,"Selvbetaling i kr. (udgifter udover den øvre tilsagnsramme)",null,{"$f":"IF(C51>300,0,MAX(D49+D54+D44+D42+D24+D26-D56,0))","v":{"$error":"#REF!"}}]
[]
[null,"Tilsagnsbeløb i kr.",null,{"$f":"Slutregnskab!J10","v":{"$error":"#REF!"}}]

{"sheet":"Medarbejder 24","index":25,"n_rows":63,"n_cols":6,"rows_kept":63,"cut":false,"hidden":true,"merged":[[62,1,62,2],[60,1,60,2],[16,1,16,2],[33,1,33,2],[58,1,58,2],[46,1,46,2],[34,1,34,2],[22,1,22,2],[23,1,23,2],[24,1,24,2],[25,1,25,2],[27,1,27,2],[28,1,28,2],[29,1,29,2],[30,1,30,2],[31,1,31,2],[8,4,8,5],[21,1,21,2],[9,1,9,2],[9,4,9,5],[10,1,10,2],[11,1,11,3],[12,1,12,3],[14,1,14,3],[17,1,17,2],[18,1,18,2],[19,1,19,2],[20,1,20,2],[1,1,1,3],[3,1,3,3],[5,1,5,2],[6,1,6,2],[8,1,8,2],[7,1,7,2],[32,1,32,2],[48,1,48,2],[55,1,56,2],[55,3,56,3],[47,1,47,2],[35,1,35,2],[36,1,36,2],[37,1,37,2],[38,1,38,2],[39,1,39,2],[40,1,40,2],[41,1,41,2],[42,1,42,2],[43,1,43,2],[45,1,45,2]]}
[]
[null,"Slutregnskab for sporskiftepakken"]
[]
[null,"Oplysninger om medarbejderen"]
[]
[null,"Medarbejderens navn"]
[null,"Medarbejderens lønkompensation fra sporskifte (kr./t.)",null,{"$f":"IF(D8>261,(IF(D11=\"Ja\",260-'Format ark'!D13,260)),IF(D8<=260,IF(D11=\"Ja\",IF(D8<'Format ark'!D13,0,D8-'Format ark'!D13),D8)))","v":0}]
[null,"Medarbejderens timesats (kr./t.)"]
[null,"Medarbejderens højst gennemførte uddannelse",null,null,{"$f":"IF(D9=\"\",\"Husk at vælge medarbejderens højst gennemførte uddannelse.\",\" \")","v":"Husk at vælge medarbejderens højst gennemførte uddannelse."}]
[null,"Har medarbejderen brugt sin uddannelse de senest 5 år?",null,null,{"$f":"IF(D10=\"\",\"Husk at svare på spørgsmålet.\",\" \")","v":"Husk at svare på spørgsmålet."}]
[null,"Medarbejder formodes at være berettiget til at få VEU-godtgørelse ",null,{"$f":"IF(OR(D9=\"Videregående uddannelse\",D9=\"Gymnasial uddannelse\")*AND(D10=\"ja\"),\"Nej\",\"Ja\")","v":"Ja"}]
[null,"Beskriv herunder hvad formålet med den planlagte sporskiftepakke er for medarbejderen:"]
[]
[]
[null,"Aktiviteter"]
[]
[null,"Afklaring, vejledning mv. \nSkriv navn på kursus",null,"Medarbejderens timeforbug (timer)","Evt. deltagerbetaling (kr.)","Giver kurset ret til VEU-godtgørelse?"]
[]
[]
[]
[]
[]
[null,"Samlet antal timer (udregner selv)",null,{"$f":"SUM(D18:D22)","v":0}]
[null,"Samlet lønkompensation udover evt. VEU-godtgørelse (udregner selv)",null,{"$f":"IF(D11=\"Nej\",D23*D7,0)+IF(AND(D11=\"Ja\",F18=\"Ja\"),D18*D7,0)+IF(AND(D11=\"Ja\",F19=\"Ja\"),D19*D7,0)+IF(AND(D11=\"Ja\",F20=\"Ja\"),D20*D7,0)+IF(AND(D11=\"Ja\",F21=\"Ja\"),D21*D7,0)+IF(AND(D11=\"Ja\",F22=\"Ja\"),D22*D7,0)+IF(AND(D11=\"Ja\",F18=\"Nej\"),D18*IF(D8>261,(IF(F18=\"Ja\",260-'Format ark'!D13,260)),IF(D8<=260,IF(F18=\"Ja\",D8-'Format ark'!D13,D8))),0)+IF(AND(D11=\"Ja\",F19=\"Nej\"),D19*IF(D8>261,(IF(F19=\"Ja\",260-'Format ark'!D13,260)),IF(D8<=260,IF(F19=\"Ja\",D8-'Format ark'!D13,D8))),0)+IF(AND(D11=\"Ja\",F20=\"Nej\"),D20*IF(D8>261,(IF(F20=\"Ja\",260-'Format ark'!D13,260)),IF(D8<=260,IF(F20=\"Ja\",D8-'Format ark'!D13,D8))),0)+IF(AND(D11=\"Ja\",F21=\"Nej\"),D21*IF(D8>261,(IF(F21=\"Ja\",260-'Format ark'!D13,260)),IF(D8<=260,IF(F21=\"Ja\",D8-'Format ark'!D13,D8))),0)+IF(AND(D11=\"Ja\",F22=\"Nej\"),D22*IF(D8>261,(IF(F22=\"Ja\",260-'Format ark'!D13,260)),IF(D8<=260,IF(F22=\"Ja\",D8-'Format ark'!D13,D8))),0)","v":0}]
[null,"Estimeret VEU-godtgørelse",null,{"$f":"IF(AND(D11=\"Ja\",F18=\"Ja\"),D18*'Format ark'!D13,0)+IF(AND(D11=\"Ja\",F19=\"Ja\"),D19*'Format ark'!D13,0)+IF(AND(D11=\"Ja\",F20=\"Ja\"),D20*'Format ark'!D13,0)+IF(AND(D11=\"Ja\",F21=\"Ja\"),D21*'Format ark'!D13,0)+IF(AND(D11=\"Ja\",F22=\"Ja\"),D22*'Format ark'!D13,0)","v":0}]
[null,"Samlet deltagerbeltaing (udregner selv)",null,{"$f":"SUM(E18:E22)","v":0}]
[]
[null,"Erhversrettet efteruddannelse\nSkriv navn på efteruddannelse",null,"Medarbejderens timeforbrug (timer)","Evt. deltagerbetaling (kr.)","Giver kurset ret til VEU-godtgørelse?"]
[]
[]
[]
[]
[]
[]
[]
[]
[]
[]
[]
[]
[null,"Samlet antal timer (udregner selv)",null,{"$f":"SUM(D29:D40)","v":0}]
[null,"Samlet lønkompensation udover evt. VEU-godtgørelse (udregner selv)",null,{"$f":"IF(D11=\"Nej\",D41*D7,0)+IF(AND(D11=\"Ja\",F29=\"Ja\"),D29*D7,0)+IF(AND(D11=\"Ja\",F30=\"Ja\"),D30*D7,0)+IF(AND(D11=\"Ja\",F31=\"Ja\"),D31*D7,0)+IF(AND(D11=\"Ja\",F32=\"Ja\"),D32*D7,0)+IF(AND(D11=\"Ja\",F33=\"Ja\"),D33*D7,0)+IF(AND(D11=\"Ja\",F34=\"Ja\"),D34*D7,0)+IF(AND(D11=\"Ja\",F35=\"Ja\"),D35*D7,0)+IF(AND(D11=\"Ja\",F36=\"Ja\"),D36*D7,0)+IF(AND(D11=\"Ja\",F37=\"Ja\"),D37*D7,0)+IF(AND(D11=\"Ja\",F38=\"Ja\"),D38*D7,0)+IF(AND(D11=\"Ja\",F39=\"Ja\"),D39*D7,0)+IF(AND(D11=\"Ja\",F40=\"Ja\"),D40*D7,0)+IF(AND(D11=\"Ja\",F29=\"Nej\"),D29* IF(D8>261,(IF(F29=\"Ja\",260-'Format ark'!D13,260)),IF(D8<=260,IF(F29=\"Ja\",D8-'Format ark'!D13,D8))),0)+IF(AND(D11=\"Ja\",F30=\"Nej\"),D30* IF(D8>261,(IF(F30=\"Ja\",260-'Format ark'!D13,260)),IF(D8<=260,IF(F30=\"Ja\",D8-'Format ark'!D13,D8))),0)+IF(AND(D11=\"Ja\",F31=\"Nej\"),D31* IF(D8>261,(IF(F31=\"Ja\",260-'Format ark'!D13,260)),IF(D8<=260,IF(F31=\"Ja\",D8-'Format ark'!D13,D8))),0)+IF(AND(D11=\"Ja\",F32=\"Nej\"),D32* IF(D8>261,(IF(F32=\"Ja\",260-'Format ark'!D13,260)),IF(D8<=260,IF(F32=\"Ja\",D8-'Format ark'!D13,D8))),0)+IF(AND(D11=\"Ja\",F33=\"Nej\"),D33* IF(D8>261,(IF(F33=\"Ja\",260-'Format ark'!D13,260)),IF(D8<=260,IF(F33=\"Ja\",D8-'Format ark'!D13,D8))),0)+IF(AND(D11=\"Ja\",F34=\"Nej\"),D34* IF(D8>261,(IF(F34=\"Ja\",260-'Format ark'!D13,260)),IF(D8<=260,IF(F34=\"Ja\",D8-'Format ark'!D13,D8))),0)+IF(AND(D11=\"Ja\",F35=\"Nej\"),D35* IF(D8>261,(IF(F35=\"Ja\",260-'Format ark'!D13,260)),IF(D8<=260,IF(F35=\"Ja\",D8-'Format ark'!D13,D8))),0)+IF(AND(D11=\"Ja\",F36=\"Nej\"),D36* IF(D8>261,(IF(F36=\"Ja\",260-'Format ark'!D13,260)),IF(D8<=260,IF(F36=\"Ja\",D8-'Format ark'!D13,D8))),0)+IF(AND(D11=\"Ja\",F37=\"Nej\"),D37* IF(D8>261,(IF(F37=\"Ja\",260-'Format ark'!D13,260)),IF(D8<=260,IF(F37=\"Ja\",D8-'Format ark'!D13,D8))),0)+IF(AND(D11=\"Ja\",F38=\"Nej\"),D38* IF(D8>261,(IF(F38=\"Ja\",260-'Format ark'!D13,260)),IF(D8<=260,IF(F38=\"Ja\",D8-'Format ark'!D13,D8))),0)+IF(AND(D11=\"Ja\",F39=\"Nej\"),D39* IF(D8>261,(IF(F39=\"Ja\",260-'Format ark'!D13,260)),IF(D8<=260,IF(F39=\"Ja\",D8-'Format ark'!D13,D8))),0)+IF(AND(D11=\"Ja\",F40=\"Nej\"),D40* IF(D8>261,(IF(F40=\"Ja\",260-'Format ark'!D13,260)),IF(D8<=260,IF(F40=\"Ja\",D8-'Format ark'!D13,D8))),0)","v":0}]
[null,"Estimeret VEU-godtgørelse",null,{"$f":"IF(AND(D11=\"Ja\",F29=\"Ja\"),D29*'Format ark'!D13,0)+IF(AND(D11=\"Ja\",F30=\"Ja\"),D30*'Format ark'!D13,0)+IF(AND(D11=\"Ja\",F31=\"Ja\"),D31*'Format ark'!D13,0)+IF(AND(D11=\"Ja\",F32=\"Ja\"),D32*('Format ark'!D13),0)+IF(AND(D11=\"Ja\",F33=\"Ja\"),D33*'Format ark'!D13,0)+IF(AND(D11=\"Ja\",F34=\"Ja\"),D34*'Format ark'!D13,0)+IF(AND(D11=\"Ja\",F35=\"Ja\"),D35*'Format ark'!D13,0)+IF(AND(D11=\"Ja\",F36=\"Ja\"),D36*'Format ark'!D13,0)+IF(AND(D11=\"Ja\",F37=\"Ja\"),D37*'Format ark'!D13,0)+IF(AND(D11=\"Ja\",F38=\"Ja\"),D38*'Format ark'!D13,0)+IF(AND(D11=\"Ja\",F39=\"Ja\"),D39*'Format ark'!D13,0)+IF(AND(D11=\"Ja\",F40=\"Ja\"),D40*'Format ark'!D13,0)","v":0}]
[null,"Samlet deltagerbetaling (udregner selv)",null,{"$f":"SUM(E29:E40)","v":0}]
[]
[null,"Praktik"]
[null,"Navn på virksomhed og p-nummer"]
[null,"Medarbejderens timeforbrug",null,null,{"$f":"IF(D48>C51*0.5,\"Praktik må maksimalt udgøre 50% af det samlede tidsforbrug.\",\" \")","v":" "}]
[null,"Samlet lønkompensation for praktikopholdet",null,{"$f":"IF(D48>C51*0.5,\"IKKE MULIGT\",D48*(IF(D8>261,260,D8)))","v":0}]
[]
[null,"Samlet tidsforbrug ",{"$f":"IF(D48+D41+D23>300,\"IKKE MULIGT\",D48+D41+D23)","v":0},{"$f":"IF(C51>300,\"Det maksimale tidsforbrug er 300 timer\",\" \")","v":" "}]
[]
[null,"Tidsforbrug til administration","Antal timer","Beløb"]
[null,"Der kan godtgøres op til 5 timer.",null,{"$f":"IF(C54>5,\"Der kan maksimalt godtgøres 5 timer pr. medarbejder.\",C54*260)","v":0}]
[]
[null,"Samlet tilsagnsramme i kr. (maksimal støtte til sporskiftepakken): ",null,{"$f":"IF(AND(C51>300,D49+D44+D42+D26+D24+D54<D63+1),0,MIN(D49+D44+D42+D26+D24+D54,120000))","v":{"$error":"#REF!"}},{"$f":"IF(D56=120000,\"Det maksimale tilsagn pr. sporskiftepakke er nået, og det overstigende beløb er derfor selvbetaling.\",\"\")","v":{"$error":"#REF!"}}]
[]
[]
[null,"Estimeret VEU-godtgørelse",null,{"$f":"D43+D25","v":0}]
[]
[null,"Selvbetaling i kr. (udgifter udover den øvre tilsagnsramme)",null,{"$f":"IF(C51>300,0,MAX(D49+D54+D44+D42+D24+D26-D56,0))","v":{"$error":"#REF!"}}]
[]
[null,"Tilsagnsbeløb i kr.",null,{"$f":"Slutregnskab!J10","v":{"$error":"#REF!"}}]

{"sheet":"Medarbejder 25","index":26,"n_rows":63,"n_cols":6,"rows_kept":63,"cut":false,"hidden":true,"merged":[[62,1,62,2],[60,1,60,2],[16,1,16,2],[33,1,33,2],[58,1,58,2],[46,1,46,2],[34,1,34,2],[22,1,22,2],[23,1,23,2],[24,1,24,2],[25,1,25,2],[27,1,27,2],[28,1,28,2],[29,1,29,2],[30,1,30,2],[31,1,31,2],[8,4,8,5],[21,1,21,2],[9,1,9,2],[9,4,9,5],[10,1,10,2],[11,1,11,3],[12,1,12,3],[14,1,14,3],[17,1,17,2],[18,1,18,2],[19,1,19,2],[20,1,20,2],[1,1,1,3],[3,1,3,3],[5,1,5,2],[6,1,6,2],[8,1,8,2],[7,1,7,2],[32,1,32,2],[48,1,48,2],[55,1,56,2],[55,3,56,3],[47,1,47,2],[35,1,35,2],[36,1,36,2],[37,1,37,2],[38,1,38,2],[39,1,39,2],[40,1,40,2],[41,1,41,2],[42,1,42,2],[43,1,43,2],[45,1,45,2]]}
[]
[null,"Slutregnskab for sporskiftepakken"]
[]
[null,"Oplysninger om medarbejderen"]
[]
[null,"Medarbejderens navn"]
[null,"Medarbejderens lønkompensation fra sporskifte (kr./t.)",null,{"$f":"IF(D8>261,(IF(D11=\"Ja\",260-'Format ark'!D13,260)),IF(D8<=260,IF(D11=\"Ja\",IF(D8<'Format ark'!D13,0,D8-'Format ark'!D13),D8)))","v":0}]
[null,"Medarbejderens timesats (kr./t.)"]
[null,"Medarbejderens højst gennemførte uddannelse",null,null,{"$f":"IF(D9=\"\",\"Husk at vælge medarbejderens højst gennemførte uddannelse.\",\" \")","v":"Husk at vælge medarbejderens højst gennemførte uddannelse."}]
[null,"Har medarbejderen brugt sin uddannelse de senest 5 år?",null,null,{"$f":"IF(D10=\"\",\"Husk at svare på spørgsmålet.\",\" \")","v":"Husk at svare på spørgsmålet."}]
[null,"Medarbejder formodes at være berettiget til at få VEU-godtgørelse ",null,{"$f":"IF(OR(D9=\"Videregående uddannelse\",D9=\"Gymnasial uddannelse\")*AND(D10=\"ja\"),\"Nej\",\"Ja\")","v":"Ja"}]
[null,"Beskriv herunder hvad formålet med den planlagte sporskiftepakke er for medarbejderen:"]
[]
[]
[null,"Aktiviteter"]
[]
[null,"Afklaring, vejledning mv. \nSkriv navn på kursus",null,"Medarbejderens timeforbug (timer)","Evt. deltagerbetaling (kr.)","Giver kurset ret til VEU-godtgørelse?"]
[]
[]
[]
[]
[]
[null,"Samlet antal timer (udregner selv)",null,{"$f":"SUM(D18:D22)","v":0}]
[null,"Samlet lønkompensation udover evt. VEU-godtgørelse (udregner selv)",null,{"$f":"IF(D11=\"Nej\",D23*D7,0)+IF(AND(D11=\"Ja\",F18=\"Ja\"),D18*D7,0)+IF(AND(D11=\"Ja\",F19=\"Ja\"),D19*D7,0)+IF(AND(D11=\"Ja\",F20=\"Ja\"),D20*D7,0)+IF(AND(D11=\"Ja\",F21=\"Ja\"),D21*D7,0)+IF(AND(D11=\"Ja\",F22=\"Ja\"),D22*D7,0)+IF(AND(D11=\"Ja\",F18=\"Nej\"),D18*IF(D8>261,(IF(F18=\"Ja\",260-'Format ark'!D13,260)),IF(D8<=260,IF(F18=\"Ja\",D8-'Format ark'!D13,D8))),0)+IF(AND(D11=\"Ja\",F19=\"Nej\"),D19*IF(D8>261,(IF(F19=\"Ja\",260-'Format ark'!D13,260)),IF(D8<=260,IF(F19=\"Ja\",D8-'Format ark'!D13,D8))),0)+IF(AND(D11=\"Ja\",F20=\"Nej\"),D20*IF(D8>261,(IF(F20=\"Ja\",260-'Format ark'!D13,260)),IF(D8<=260,IF(F20=\"Ja\",D8-'Format ark'!D13,D8))),0)+IF(AND(D11=\"Ja\",F21=\"Nej\"),D21*IF(D8>261,(IF(F21=\"Ja\",260-'Format ark'!D13,260)),IF(D8<=260,IF(F21=\"Ja\",D8-'Format ark'!D13,D8))),0)+IF(AND(D11=\"Ja\",F22=\"Nej\"),D22*IF(D8>261,(IF(F22=\"Ja\",260-'Format ark'!D13,260)),IF(D8<=260,IF(F22=\"Ja\",D8-'Format ark'!D13,D8))),0)","v":0}]
[null,"Estimeret VEU-godtgørelse",null,{"$f":"IF(AND(D11=\"Ja\",F18=\"Ja\"),D18*'Format ark'!D13,0)+IF(AND(D11=\"Ja\",F19=\"Ja\"),D19*'Format ark'!D13,0)+IF(AND(D11=\"Ja\",F20=\"Ja\"),D20*'Format ark'!D13,0)+IF(AND(D11=\"Ja\",F21=\"Ja\"),D21*'Format ark'!D13,0)+IF(AND(D11=\"Ja\",F22=\"Ja\"),D22*'Format ark'!D13,0)","v":0}]
[null,"Samlet deltagerbeltaing (udregner selv)",null,{"$f":"SUM(E18:E22)","v":0}]
[]
[null,"Erhversrettet efteruddannelse\nSkriv navn på efteruddannelse",null,"Medarbejderens timeforbrug (timer)","Evt. deltagerbetaling (kr.)","Giver kurset ret til VEU-godtgørelse?"]
[]
[]
[]
[]
[]
[]
[]
[]
[]
[]
[]
[]
[null,"Samlet antal timer (udregner selv)",null,{"$f":"SUM(D29:D40)","v":0}]
[null,"Samlet lønkompensation udover evt. VEU-godtgørelse (udregner selv)",null,{"$f":"IF(D11=\"Nej\",D41*D7,0)+IF(AND(D11=\"Ja\",F29=\"Ja\"),D29*D7,0)+IF(AND(D11=\"Ja\",F30=\"Ja\"),D30*D7,0)+IF(AND(D11=\"Ja\",F31=\"Ja\"),D31*D7,0)+IF(AND(D11=\"Ja\",F32=\"Ja\"),D32*D7,0)+IF(AND(D11=\"Ja\",F33=\"Ja\"),D33*D7,0)+IF(AND(D11=\"Ja\",F34=\"Ja\"),D34*D7,0)+IF(AND(D11=\"Ja\",F35=\"Ja\"),D35*D7,0)+IF(AND(D11=\"Ja\",F36=\"Ja\"),D36*D7,0)+IF(AND(D11=\"Ja\",F37=\"Ja\"),D37*D7,0)+IF(AND(D11=\"Ja\",F38=\"Ja\"),D38*D7,0)+IF(AND(D11=\"Ja\",F39=\"Ja\"),D39*D7,0)+IF(AND(D11=\"Ja\",F40=\"Ja\"),D40*D7,0)+IF(AND(D11=\"Ja\",F29=\"Nej\"),D29* IF(D8>261,(IF(F29=\"Ja\",260-'Format ark'!D13,260)),IF(D8<=260,IF(F29=\"Ja\",D8-'Format ark'!D13,D8))),0)+IF(AND(D11=\"Ja\",F30=\"Nej\"),D30* IF(D8>261,(IF(F30=\"Ja\",260-'Format ark'!D13,260)),IF(D8<=260,IF(F30=\"Ja\",D8-'Format ark'!D13,D8))),0)+IF(AND(D11=\"Ja\",F31=\"Nej\"),D31* IF(D8>261,(IF(F31=\"Ja\",260-'Format ark'!D13,260)),IF(D8<=260,IF(F31=\"Ja\",D8-'Format ark'!D13,D8))),0)+IF(AND(D11=\"Ja\",F32=\"Nej\"),D32* IF(D8>261,(IF(F32=\"Ja\",260-'Format ark'!D13,260)),IF(D8<=260,IF(F32=\"Ja\",D8-'Format ark'!D13,D8))),0)+IF(AND(D11=\"Ja\",F33=\"Nej\"),D33* IF(D8>261,(IF(F33=\"Ja\",260-'Format ark'!D13,260)),IF(D8<=260,IF(F33=\"Ja\",D8-'Format ark'!D13,D8))),0)+IF(AND(D11=\"Ja\",F34=\"Nej\"),D34* IF(D8>261,(IF(F34=\"Ja\",260-'Format ark'!D13,260)),IF(D8<=260,IF(F34=\"Ja\",D8-'Format ark'!D13,D8))),0)+IF(AND(D11=\"Ja\",F35=\"Nej\"),D35* IF(D8>261,(IF(F35=\"Ja\",260-'Format ark'!D13,260)),IF(D8<=260,IF(F35=\"Ja\",D8-'Format ark'!D13,D8))),0)+IF(AND(D11=\"Ja\",F36=\"Nej\"),D36* IF(D8>261,(IF(F36=\"Ja\",260-'Format ark'!D13,260)),IF(D8<=260,IF(F36=\"Ja\",D8-'Format ark'!D13,D8))),0)+IF(AND(D11=\"Ja\",F37=\"Nej\"),D37* IF(D8>261,(IF(F37=\"Ja\",260-'Format ark'!D13,260)),IF(D8<=260,IF(F37=\"Ja\",D8-'Format ark'!D13,D8))),0)+IF(AND(D11=\"Ja\",F38=\"Nej\"),D38* IF(D8>261,(IF(F38=\"Ja\",260-'Format ark'!D13,260)),IF(D8<=260,IF(F38=\"Ja\",D8-'Format ark'!D13,D8))),0)+IF(AND(D11=\"Ja\",F39=\"Nej\"),D39* IF(D8>261,(IF(F39=\"Ja\",260-'Format ark'!D13,260)),IF(D8<=260,IF(F39=\"Ja\",D8-'Format ark'!D13,D8))),0)+IF(AND(D11=\"Ja\",F40=\"Nej\"),D40* IF(D8>261,(IF(F40=\"Ja\",260-'Format ark'!D13,260)),IF(D8<=260,IF(F40=\"Ja\",D8-'Format ark'!D13,D8))),0)","v":0}]
[null,"Estimeret VEU-godtgørelse",null,{"$f":"IF(AND(D11=\"Ja\",F29=\"Ja\"),D29*'Format ark'!D13,0)+IF(AND(D11=\"Ja\",F30=\"Ja\"),D30*'Format ark'!D13,0)+IF(AND(D11=\"Ja\",F31=\"Ja\"),D31*'Format ark'!D13,0)+IF(AND(D11=\"Ja\",F32=\"Ja\"),D32*('Format ark'!D13),0)+IF(AND(D11=\"Ja\",F33=\"Ja\"),D33*'Format ark'!D13,0)+IF(AND(D11=\"Ja\",F34=\"Ja\"),D34*'Format ark'!D13,0)+IF(AND(D11=\"Ja\",F35=\"Ja\"),D35*'Format ark'!D13,0)+IF(AND(D11=\"Ja\",F36=\"Ja\"),D36*'Format ark'!D13,0)+IF(AND(D11=\"Ja\",F37=\"Ja\"),D37*'Format ark'!D13,0)+IF(AND(D11=\"Ja\",F38=\"Ja\"),D38*'Format ark'!D13,0)+IF(AND(D11=\"Ja\",F39=\"Ja\"),D39*'Format ark'!D13,0)+IF(AND(D11=\"Ja\",F40=\"Ja\"),D40*'Format ark'!D13,0)","v":0}]
[null,"Samlet deltagerbetaling (udregner selv)",null,{"$f":"SUM(E29:E40)","v":0}]
[]
[null,"Praktik"]
[null,"Navn på virksomhed og p-nummer"]
[null,"Medarbejderens timeforbrug",null,null,{"$f":"IF(D48>C51*0.5,\"Praktik må maksimalt udgøre 50% af det samlede tidsforbrug.\",\" \")","v":" "}]
[null,"Samlet lønkompensation for praktikopholdet",null,{"$f":"IF(D48>C51*0.5,\"IKKE MULIGT\",D48*(IF(D8>261,260,D8)))","v":0}]
[]
[null,"Samlet tidsforbrug ",{"$f":"IF(D48+D41+D23>300,\"IKKE MULIGT\",D48+D41+D23)","v":0},{"$f":"IF(C51>300,\"Det maksimale tidsforbrug er 300 timer\",\" \")","v":" "}]
[]
[null,"Tidsforbrug til administration","Antal timer","Beløb"]
[null,"Der kan godtgøres op til 5 timer.",null,{"$f":"IF(C54>5,\"Der kan maksimalt godtgøres 5 timer pr. medarbejder.\",C54*260)","v":0}]
[]
[null,"Samlet tilsagnsramme i kr. (maksimal støtte til sporskiftepakken): ",null,{"$f":"IF(AND(C51>300,D49+D44+D42+D26+D24+D54<D63+1),0,MIN(D49+D44+D42+D26+D24+D54,120000))","v":{"$error":"#REF!"}},{"$f":"IF(D56=120000,\"Det maksimale tilsagn pr. sporskiftepakke er nået, og det overstigende beløb er derfor selvbetaling.\",\"\")","v":{"$error":"#REF!"}}]
[]
[]
[null,"Estimeret VEU-godtgørelse",null,{"$f":"D43+D25","v":0}]
[]
[null,"Selvbetaling i kr. (udgifter udover den øvre tilsagnsramme)",null,{"$f":"IF(C51>300,0,MAX(D49+D54+D44+D42+D24+D26-D56,0))","v":{"$error":"#REF!"}}]
[]
[null,"Tilsagnsbeløb i kr.",null,{"$f":"Slutregnskab!J10","v":{"$error":"#REF!"}}]

{"sheet":"Medarbejder 26","index":27,"n_rows":63,"n_cols":6,"rows_kept":63,"cut":false,"hidden":true,"merged":[[62,1,62,2],[60,1,60,2],[16,1,16,2],[33,1,33,2],[58,1,58,2],[46,1,46,2],[34,1,34,2],[22,1,22,2],[23,1,23,2],[24,1,24,2],[25,1,25,2],[27,1,27,2],[28,1,28,2],[29,1,29,2],[30,1,30,2],[31,1,31,2],[8,4,8,5],[21,1,21,2],[9,1,9,2],[9,4,9,5],[10,1,10,2],[11,1,11,3],[12,1,12,3],[14,1,14,3],[17,1,17,2],[18,1,18,2],[19,1,19,2],[20,1,20,2],[1,1,1,3],[3,1,3,3],[5,1,5,2],[6,1,6,2],[8,1,8,2],[7,1,7,2],[32,1,32,2],[48,1,48,2],[55,1,56,2],[55,3,56,3],[47,1,47,2],[35,1,35,2],[36,1,36,2],[37,1,37,2],[38,1,38,2],[39,1,39,2],[40,1,40,2],[41,1,41,2],[42,1,42,2],[43,1,43,2],[45,1,45,2]]}
[]
[null,"Slutregnskab for sporskiftepakken"]
[]
[null,"Oplysninger om medarbejderen"]
[]
[null,"Medarbejderens navn"]
[null,"Medarbejderens lønkompensation fra sporskifte (kr./t.)",null,{"$f":"IF(D8>261,(IF(D11=\"Ja\",260-'Format ark'!D13,260)),IF(D8<=260,IF(D11=\"Ja\",IF(D8<'Format ark'!D13,0,D8-'Format ark'!D13),D8)))","v":0}]
[null,"Medarbejderens timesats (kr./t.)"]
[null,"Medarbejderens højst gennemførte uddannelse",null,null,{"$f":"IF(D9=\"\",\"Husk at vælge medarbejderens højst gennemførte uddannelse.\",\" \")","v":"Husk at vælge medarbejderens højst gennemførte uddannelse."}]
[null,"Har medarbejderen brugt sin uddannelse de senest 5 år?",null,null,{"$f":"IF(D10=\"\",\"Husk at svare på spørgsmålet.\",\" \")","v":"Husk at svare på spørgsmålet."}]
[null,"Medarbejder formodes at være berettiget til at få VEU-godtgørelse ",null,{"$f":"IF(OR(D9=\"Videregående uddannelse\",D9=\"Gymnasial uddannelse\")*AND(D10=\"ja\"),\"Nej\",\"Ja\")","v":"Ja"}]
[null,"Beskriv herunder hvad formålet med den planlagte sporskiftepakke er for medarbejderen:"]
[]
[]
[null,"Aktiviteter"]
[]
[null,"Afklaring, vejledning mv. \nSkriv navn på kursus",null,"Medarbejderens timeforbug (timer)","Evt. deltagerbetaling (kr.)","Giver kurset ret til VEU-godtgørelse?"]
[]
[]
[]
[]
[]
[null,"Samlet antal timer (udregner selv)",null,{"$f":"SUM(D18:D22)","v":0}]
[null,"Samlet lønkompensation udover evt. VEU-godtgørelse (udregner selv)",null,{"$f":"IF(D11=\"Nej\",D23*D7,0)+IF(AND(D11=\"Ja\",F18=\"Ja\"),D18*D7,0)+IF(AND(D11=\"Ja\",F19=\"Ja\"),D19*D7,0)+IF(AND(D11=\"Ja\",F20=\"Ja\"),D20*D7,0)+IF(AND(D11=\"Ja\",F21=\"Ja\"),D21*D7,0)+IF(AND(D11=\"Ja\",F22=\"Ja\"),D22*D7,0)+IF(AND(D11=\"Ja\",F18=\"Nej\"),D18*IF(D8>261,(IF(F18=\"Ja\",260-'Format ark'!D13,260)),IF(D8<=260,IF(F18=\"Ja\",D8-'Format ark'!D13,D8))),0)+IF(AND(D11=\"Ja\",F19=\"Nej\"),D19*IF(D8>261,(IF(F19=\"Ja\",260-'Format ark'!D13,260)),IF(D8<=260,IF(F19=\"Ja\",D8-'Format ark'!D13,D8))),0)+IF(AND(D11=\"Ja\",F20=\"Nej\"),D20*IF(D8>261,(IF(F20=\"Ja\",260-'Format ark'!D13,260)),IF(D8<=260,IF(F20=\"Ja\",D8-'Format ark'!D13,D8))),0)+IF(AND(D11=\"Ja\",F21=\"Nej\"),D21*IF(D8>261,(IF(F21=\"Ja\",260-'Format ark'!D13,260)),IF(D8<=260,IF(F21=\"Ja\",D8-'Format ark'!D13,D8))),0)+IF(AND(D11=\"Ja\",F22=\"Nej\"),D22*IF(D8>261,(IF(F22=\"Ja\",260-'Format ark'!D13,260)),IF(D8<=260,IF(F22=\"Ja\",D8-'Format ark'!D13,D8))),0)","v":0}]
[null,"Estimeret VEU-godtgørelse",null,{"$f":"IF(AND(D11=\"Ja\",F18=\"Ja\"),D18*'Format ark'!D13,0)+IF(AND(D11=\"Ja\",F19=\"Ja\"),D19*'Format ark'!D13,0)+IF(AND(D11=\"Ja\",F20=\"Ja\"),D20*'Format ark'!D13,0)+IF(AND(D11=\"Ja\",F21=\"Ja\"),D21*'Format ark'!D13,0)+IF(AND(D11=\"Ja\",F22=\"Ja\"),D22*'Format ark'!D13,0)","v":0}]
[null,"Samlet deltagerbeltaing (udregner selv)",null,{"$f":"SUM(E18:E22)","v":0}]
[]
[null,"Erhversrettet efteruddannelse\nSkriv navn på efteruddannelse",null,"Medarbejderens timeforbrug (timer)","Evt. deltagerbetaling (kr.)","Giver kurset ret til VEU-godtgørelse?"]
[]
[]
[]
[]
[]
[]
[]
[]
[]
[]
[]
[]
[null,"Samlet antal timer (udregner selv)",null,{"$f":"SUM(D29:D40)","v":0}]
[null,"Samlet lønkompensation udover evt. VEU-godtgørelse (udregner selv)",null,{"$f":"IF(D11=\"Nej\",D41*D7,0)+IF(AND(D11=\"Ja\",F29=\"Ja\"),D29*D7,0)+IF(AND(D11=\"Ja\",F30=\"Ja\"),D30*D7,0)+IF(AND(D11=\"Ja\",F31=\"Ja\"),D31*D7,0)+IF(AND(D11=\"Ja\",F32=\"Ja\"),D32*D7,0)+IF(AND(D11=\"Ja\",F33=\"Ja\"),D33*D7,0)+IF(AND(D11=\"Ja\",F34=\"Ja\"),D34*D7,0)+IF(AND(D11=\"Ja\",F35=\"Ja\"),D35*D7,0)+IF(AND(D11=\"Ja\",F36=\"Ja\"),D36*D7,0)+IF(AND(D11=\"Ja\",F37=\"Ja\"),D37*D7,0)+IF(AND(D11=\"Ja\",F38=\"Ja\"),D38*D7,0)+IF(AND(D11=\"Ja\",F39=\"Ja\"),D39*D7,0)+IF(AND(D11=\"Ja\",F40=\"Ja\"),D40*D7,0)+IF(AND(D11=\"Ja\",F29=\"Nej\"),D29* IF(D8>261,(IF(F29=\"Ja\",260-'Format ark'!D13,260)),IF(D8<=260,IF(F29=\"Ja\",D8-'Format ark'!D13,D8))),0)+IF(AND(D11=\"Ja\",F30=\"Nej\"),D30* IF(D8>261,(IF(F30=\"Ja\",260-'Format ark'!D13,260)),IF(D8<=260,IF(F30=\"Ja\",D8-'Format ark'!D13,D8))),0)+IF(AND(D11=\"Ja\",F31=\"Nej\"),D31* IF(D8>261,(IF(F31=\"Ja\",260-'Format ark'!D13,260)),IF(D8<=260,IF(F31=\"Ja\",D8-'Format ark'!D13,D8))),0)+IF(AND(D11=\"Ja\",F32=\"Nej\"),D32* IF(D8>261,(IF(F32=\"Ja\",260-'Format ark'!D13,260)),IF(D8<=260,IF(F32=\"Ja\",D8-'Format ark'!D13,D8))),0)+IF(AND(D11=\"Ja\",F33=\"Nej\"),D33* IF(D8>261,(IF(F33=\"Ja\",260-'Format ark'!D13,260)),IF(D8<=260,IF(F33=\"Ja\",D8-'Format ark'!D13,D8))),0)+IF(AND(D11=\"Ja\",F34=\"Nej\"),D34* IF(D8>261,(IF(F34=\"Ja\",260-'Format ark'!D13,260)),IF(D8<=260,IF(F34=\"Ja\",D8-'Format ark'!D13,D8))),0)+IF(AND(D11=\"Ja\",F35=\"Nej\"),D35* IF(D8>261,(IF(F35=\"Ja\",260-'Format ark'!D13,260)),IF(D8<=260,IF(F35=\"Ja\",D8-'Format ark'!D13,D8))),0)+IF(AND(D11=\"Ja\",F36=\"Nej\"),D36* IF(D8>261,(IF(F36=\"Ja\",260-'Format ark'!D13,260)),IF(D8<=260,IF(F36=\"Ja\",D8-'Format ark'!D13,D8))),0)+IF(AND(D11=\"Ja\",F37=\"Nej\"),D37* IF(D8>261,(IF(F37=\"Ja\",260-'Format ark'!D13,260)),IF(D8<=260,IF(F37=\"Ja\",D8-'Format ark'!D13,D8))),0)+IF(AND(D11=\"Ja\",F38=\"Nej\"),D38* IF(D8>261,(IF(F38=\"Ja\",260-'Format ark'!D13,260)),IF(D8<=260,IF(F38=\"Ja\",D8-'Format ark'!D13,D8))),0)+IF(AND(D11=\"Ja\",F39=\"Nej\"),D39* IF(D8>261,(IF(F39=\"Ja\",260-'Format ark'!D13,260)),IF(D8<=260,IF(F39=\"Ja\",D8-'Format ark'!D13,D8))),0)+IF(AND(D11=\"Ja\",F40=\"Nej\"),D40* IF(D8>261,(IF(F40=\"Ja\",260-'Format ark'!D13,260)),IF(D8<=260,IF(F40=\"Ja\",D8-'Format ark'!D13,D8))),0)","v":0}]
[null,"Estimeret VEU-godtgørelse",null,{"$f":"IF(AND(D11=\"Ja\",F29=\"Ja\"),D29*'Format ark'!D13,0)+IF(AND(D11=\"Ja\",F30=\"Ja\"),D30*'Format ark'!D13,0)+IF(AND(D11=\"Ja\",F31=\"Ja\"),D31*'Format ark'!D13,0)+IF(AND(D11=\"Ja\",F32=\"Ja\"),D32*('Format ark'!D13),0)+IF(AND(D11=\"Ja\",F33=\"Ja\"),D33*'Format ark'!D13,0)+IF(AND(D11=\"Ja\",F34=\"Ja\"),D34*'Format ark'!D13,0)+IF(AND(D11=\"Ja\",F35=\"Ja\"),D35*'Format ark'!D13,0)+IF(AND(D11=\"Ja\",F36=\"Ja\"),D36*'Format ark'!D13,0)+IF(AND(D11=\"Ja\",F37=\"Ja\"),D37*'Format ark'!D13,0)+IF(AND(D11=\"Ja\",F38=\"Ja\"),D38*'Format ark'!D13,0)+IF(AND(D11=\"Ja\",F39=\"Ja\"),D39*'Format ark'!D13,0)+IF(AND(D11=\"Ja\",F40=\"Ja\"),D40*'Format ark'!D13,0)","v":0}]
[null,"Samlet deltagerbetaling (udregner selv)",null,{"$f":"SUM(E29:E40)","v":0}]
[]
[null,"Praktik"]
[null,"Navn på virksomhed og p-nummer"]
[null,"Medarbejderens timeforbrug",null,null,{"$f":"IF(D48>C51*0.5,\"Praktik må maksimalt udgøre 50% af det samlede tidsforbrug.\",\" \")","v":" "}]
[null,"Samlet lønkompensation for praktikopholdet",null,{"$f":"IF(D48>C51*0.5,\"IKKE MULIGT\",D48*(IF(D8>261,260,D8)))","v":0}]
[]
[null,"Samlet tidsforbrug ",{"$f":"IF(D48+D41+D23>300,\"IKKE MULIGT\",D48+D41+D23)","v":0},{"$f":"IF(C51>300,\"Det maksimale tidsforbrug er 300 timer\",\" \")","v":" "}]
[]
[null,"Tidsforbrug til administration","Antal timer","Beløb"]
[null,"Der kan godtgøres op til 5 timer.",null,{"$f":"IF(C54>5,\"Der kan maksimalt godtgøres 5 timer pr. medarbejder.\",C54*260)","v":0}]
[]
[null,"Samlet tilsagnsramme i kr. (maksimal støtte til sporskiftepakken): ",null,{"$f":"IF(AND(C51>300,D49+D44+D42+D26+D24+D54<D63+1),0,MIN(D49+D44+D42+D26+D24+D54,120000))","v":{"$error":"#REF!"}},{"$f":"IF(D56=120000,\"Det maksimale tilsagn pr. sporskiftepakke er nået, og det overstigende beløb er derfor selvbetaling.\",\"\")","v":{"$error":"#REF!"}}]
[]
[]
[null,"Estimeret VEU-godtgørelse",null,{"$f":"D43+D25","v":0}]
[]
[null,"Selvbetaling i kr. (udgifter udover den øvre tilsagnsramme)",null,{"$f":"IF(C51>300,0,MAX(D49+D54+D44+D42+D24+D26-D56,0))","v":{"$error":"#REF!"}}]
[]
[null,"Tilsagnsbeløb i kr.",null,{"$f":"Slutregnskab!J10","v":{"$error":"#REF!"}}]

{"sheet":"Medarbejder 27","index":28,"n_rows":63,"n_cols":6,"rows_kept":63,"cut":false,"hidden":true,"merged":[[62,1,62,2],[60,1,60,2],[16,1,16,2],[33,1,33,2],[58,1,58,2],[46,1,46,2],[34,1,34,2],[22,1,22,2],[23,1,23,2],[24,1,24,2],[25,1,25,2],[27,1,27,2],[28,1,28,2],[29,1,29,2],[30,1,30,2],[31,1,31,2],[8,4,8,5],[21,1,21,2],[9,1,9,2],[9,4,9,5],[10,1,10,2],[11,1,11,3],[12,1,12,3],[14,1,14,3],[17,1,17,2],[18,1,18,2],[19,1,19,2],[20,1,20,2],[1,1,1,3],[3,1,3,3],[5,1,5,2],[6,1,6,2],[8,1,8,2],[7,1,7,2],[32,1,32,2],[48,1,48,2],[55,1,56,2],[55,3,56,3],[47,1,47,2],[35,1,35,2],[36,1,36,2],[37,1,37,2],[38,1,38,2],[39,1,39,2],[40,1,40,2],[41,1,41,2],[42,1,42,2],[43,1,43,2],[45,1,45,2]]}
[]
[null,"Slutregnskab for sporskiftepakken"]
[]
[null,"Oplysninger om medarbejderen"]
[]
[null,"Medarbejderens navn"]
[null,"Medarbejderens lønkompensation fra sporskifte (kr./t.)",null,{"$f":"IF(D8>261,(IF(D11=\"Ja\",260-'Format ark'!D13,260)),IF(D8<=260,IF(D11=\"Ja\",IF(D8<'Format ark'!D13,0,D8-'Format ark'!D13),D8)))","v":0}]
[null,"Medarbejderens timesats (kr./t.)"]
[null,"Medarbejderens højst gennemførte uddannelse",null,null,{"$f":"IF(D9=\"\",\"Husk at vælge medarbejderens højst gennemførte uddannelse.\",\" \")","v":"Husk at vælge medarbejderens højst gennemførte uddannelse."}]
[null,"Har medarbejderen brugt sin uddannelse de senest 5 år?",null,null,{"$f":"IF(D10=\"\",\"Husk at svare på spørgsmålet.\",\" \")","v":"Husk at svare på spørgsmålet."}]
[null,"Medarbejder formodes at være berettiget til at få VEU-godtgørelse ",null,{"$f":"IF(OR(D9=\"Videregående uddannelse\",D9=\"Gymnasial uddannelse\")*AND(D10=\"ja\"),\"Nej\",\"Ja\")","v":"Ja"}]
[null,"Beskriv herunder hvad formålet med den planlagte sporskiftepakke er for medarbejderen:"]
[]
[]
[null,"Aktiviteter"]
[]
[null,"Afklaring, vejledning mv. \nSkriv navn på kursus",null,"Medarbejderens timeforbug (timer)","Evt. deltagerbetaling (kr.)","Giver kurset ret til VEU-godtgørelse?"]
[]
[]
[]
[]
[]
[null,"Samlet antal timer (udregner selv)",null,{"$f":"SUM(D18:D22)","v":0}]
[null,"Samlet lønkompensation udover evt. VEU-godtgørelse (udregner selv)",null,{"$f":"IF(D11=\"Nej\",D23*D7,0)+IF(AND(D11=\"Ja\",F18=\"Ja\"),D18*D7,0)+IF(AND(D11=\"Ja\",F19=\"Ja\"),D19*D7,0)+IF(AND(D11=\"Ja\",F20=\"Ja\"),D20*D7,0)+IF(AND(D11=\"Ja\",F21=\"Ja\"),D21*D7,0)+IF(AND(D11=\"Ja\",F22=\"Ja\"),D22*D7,0)+IF(AND(D11=\"Ja\",F18=\"Nej\"),D18*IF(D8>261,(IF(F18=\"Ja\",260-'Format ark'!D13,260)),IF(D8<=260,IF(F18=\"Ja\",D8-'Format ark'!D13,D8))),0)+IF(AND(D11=\"Ja\",F19=\"Nej\"),D19*IF(D8>261,(IF(F19=\"Ja\",260-'Format ark'!D13,260)),IF(D8<=260,IF(F19=\"Ja\",D8-'Format ark'!D13,D8))),0)+IF(AND(D11=\"Ja\",F20=\"Nej\"),D20*IF(D8>261,(IF(F20=\"Ja\",260-'Format ark'!D13,260)),IF(D8<=260,IF(F20=\"Ja\",D8-'Format ark'!D13,D8))),0)+IF(AND(D11=\"Ja\",F21=\"Nej\"),D21*IF(D8>261,(IF(F21=\"Ja\",260-'Format ark'!D13,260)),IF(D8<=260,IF(F21=\"Ja\",D8-'Format ark'!D13,D8))),0)+IF(AND(D11=\"Ja\",F22=\"Nej\"),D22*IF(D8>261,(IF(F22=\"Ja\",260-'Format ark'!D13,260)),IF(D8<=260,IF(F22=\"Ja\",D8-'Format ark'!D13,D8))),0)","v":0}]
[null,"Estimeret VEU-godtgørelse",null,{"$f":"IF(AND(D11=\"Ja\",F18=\"Ja\"),D18*'Format ark'!D13,0)+IF(AND(D11=\"Ja\",F19=\"Ja\"),D19*'Format ark'!D13,0)+IF(AND(D11=\"Ja\",F20=\"Ja\"),D20*'Format ark'!D13,0)+IF(AND(D11=\"Ja\",F21=\"Ja\"),D21*'Format ark'!D13,0)+IF(AND(D11=\"Ja\",F22=\"Ja\"),D22*'Format ark'!D13,0)","v":0}]
[null,"Samlet deltagerbeltaing (udregner selv)",null,{"$f":"SUM(E18:E22)","v":0}]
[]
[null,"Erhversrettet efteruddannelse\nSkriv navn på efteruddannelse",null,"Medarbejderens timeforbrug (timer)","Evt. deltagerbetaling (kr.)","Giver kurset ret til VEU-godtgørelse?"]
[]
[]
[]
[]
[]
[]
[]
[]
[]
[]
[]
[]
[null,"Samlet antal timer (udregner selv)",null,{"$f":"SUM(D29:D40)","v":0}]
[null,"Samlet lønkompensation udover evt. VEU-godtgørelse (udregner selv)",null,{"$f":"IF(D11=\"Nej\",D41*D7,0)+IF(AND(D11=\"Ja\",F29=\"Ja\"),D29*D7,0)+IF(AND(D11=\"Ja\",F30=\"Ja\"),D30*D7,0)+IF(AND(D11=\"Ja\",F31=\"Ja\"),D31*D7,0)+IF(AND(D11=\"Ja\",F32=\"Ja\"),D32*D7,0)+IF(AND(D11=\"Ja\",F33=\"Ja\"),D33*D7,0)+IF(AND(D11=\"Ja\",F34=\"Ja\"),D34*D7,0)+IF(AND(D11=\"Ja\",F35=\"Ja\"),D35*D7,0)+IF(AND(D11=\"Ja\",F36=\"Ja\"),D36*D7,0)+IF(AND(D11=\"Ja\",F37=\"Ja\"),D37*D7,0)+IF(AND(D11=\"Ja\",F38=\"Ja\"),D38*D7,0)+IF(AND(D11=\"Ja\",F39=\"Ja\"),D39*D7,0)+IF(AND(D11=\"Ja\",F40=\"Ja\"),D40*D7,0)+IF(AND(D11=\"Ja\",F29=\"Nej\"),D29* IF(D8>261,(IF(F29=\"Ja\",260-'Format ark'!D13,260)),IF(D8<=260,IF(F29=\"Ja\",D8-'Format ark'!D13,D8))),0)+IF(AND(D11=\"Ja\",F30=\"Nej\"),D30* IF(D8>261,(IF(F30=\"Ja\",260-'Format ark'!D13,260)),IF(D8<=260,IF(F30=\"Ja\",D8-'Format ark'!D13,D8))),0)+IF(AND(D11=\"Ja\",F31=\"Nej\"),D31* IF(D8>261,(IF(F31=\"Ja\",260-'Format ark'!D13,260)),IF(D8<=260,IF(F31=\"Ja\",D8-'Format ark'!D13,D8))),0)+IF(AND(D11=\"Ja\",F32=\"Nej\"),D32* IF(D8>261,(IF(F32=\"Ja\",260-'Format ark'!D13,260)),IF(D8<=260,IF(F32=\"Ja\",D8-'Format ark'!D13,D8))),0)+IF(AND(D11=\"Ja\",F33=\"Nej\"),D33* IF(D8>261,(IF(F33=\"Ja\",260-'Format ark'!D13,260)),IF(D8<=260,IF(F33=\"Ja\",D8-'Format ark'!D13,D8))),0)+IF(AND(D11=\"Ja\",F34=\"Nej\"),D34* IF(D8>261,(IF(F34=\"Ja\",260-'Format ark'!D13,260)),IF(D8<=260,IF(F34=\"Ja\",D8-'Format ark'!D13,D8))),0)+IF(AND(D11=\"Ja\",F35=\"Nej\"),D35* IF(D8>261,(IF(F35=\"Ja\",260-'Format ark'!D13,260)),IF(D8<=260,IF(F35=\"Ja\",D8-'Format ark'!D13,D8))),0)+IF(AND(D11=\"Ja\",F36=\"Nej\"),D36* IF(D8>261,(IF(F36=\"Ja\",260-'Format ark'!D13,260)),IF(D8<=260,IF(F36=\"Ja\",D8-'Format ark'!D13,D8))),0)+IF(AND(D11=\"Ja\",F37=\"Nej\"),D37* IF(D8>261,(IF(F37=\"Ja\",260-'Format ark'!D13,260)),IF(D8<=260,IF(F37=\"Ja\",D8-'Format ark'!D13,D8))),0)+IF(AND(D11=\"Ja\",F38=\"Nej\"),D38* IF(D8>261,(IF(F38=\"Ja\",260-'Format ark'!D13,260)),IF(D8<=260,IF(F38=\"Ja\",D8-'Format ark'!D13,D8))),0)+IF(AND(D11=\"Ja\",F39=\"Nej\"),D39* IF(D8>261,(IF(F39=\"Ja\",260-'Format ark'!D13,260)),IF(D8<=260,IF(F39=\"Ja\",D8-'Format ark'!D13,D8))),0)+IF(AND(D11=\"Ja\",F40=\"Nej\"),D40* IF(D8>261,(IF(F40=\"Ja\",260-'Format ark'!D13,260)),IF(D8<=260,IF(F40=\"Ja\",D8-'Format ark'!D13,D8))),0)","v":0}]
[null,"Estimeret VEU-godtgørelse",null,{"$f":"IF(AND(D11=\"Ja\",F29=\"Ja\"),D29*'Format ark'!D13,0)+IF(AND(D11=\"Ja\",F30=\"Ja\"),D30*'Format ark'!D13,0)+IF(AND(D11=\"Ja\",F31=\"Ja\"),D31*'Format ark'!D13,0)+IF(AND(D11=\"Ja\",F32=\"Ja\"),D32*('Format ark'!D13),0)+IF(AND(D11=\"Ja\",F33=\"Ja\"),D33*'Format ark'!D13,0)+IF(AND(D11=\"Ja\",F34=\"Ja\"),D34*'Format ark'!D13,0)+IF(AND(D11=\"Ja\",F35=\"Ja\"),D35*'Format ark'!D13,0)+IF(AND(D11=\"Ja\",F36=\"Ja\"),D36*'Format ark'!D13,0)+IF(AND(D11=\"Ja\",F37=\"Ja\"),D37*'Format ark'!D13,0)+IF(AND(D11=\"Ja\",F38=\"Ja\"),D38*'Format ark'!D13,0)+IF(AND(D11=\"Ja\",F39=\"Ja\"),D39*'Format ark'!D13,0)+IF(AND(D11=\"Ja\",F40=\"Ja\"),D40*'Format ark'!D13,0)","v":0}]
[null,"Samlet deltagerbetaling (udregner selv)",null,{"$f":"SUM(E29:E40)","v":0}]
[]
[null,"Praktik"]
[null,"Navn på virksomhed og p-nummer"]
[null,"Medarbejderens timeforbrug",null,null,{"$f":"IF(D48>C51*0.5,\"Praktik må maksimalt udgøre 50% af det samlede tidsforbrug.\",\" \")","v":" "}]
[null,"Samlet lønkompensation for praktikopholdet",null,{"$f":"IF(D48>C51*0.5,\"IKKE MULIGT\",D48*(IF(D8>261,260,D8)))","v":0}]
[]
[null,"Samlet tidsforbrug ",{"$f":"IF(D48+D41+D23>300,\"IKKE MULIGT\",D48+D41+D23)","v":0},{"$f":"IF(C51>300,\"Det maksimale tidsforbrug er 300 timer\",\" \")","v":" "}]
[]
[null,"Tidsforbrug til administration","Antal timer","Beløb"]
[null,"Der kan godtgøres op til 5 timer.",null,{"$f":"IF(C54>5,\"Der kan maksimalt godtgøres 5 timer pr. medarbejder.\",C54*260)","v":0}]
[]
[null,"Samlet tilsagnsramme i kr. (maksimal støtte til sporskiftepakken): ",null,{"$f":"IF(AND(C51>300,D49+D44+D42+D26+D24+D54<D63+1),0,MIN(D49+D44+D42+D26+D24+D54,120000))","v":{"$error":"#REF!"}},{"$f":"IF(D56=120000,\"Det maksimale tilsagn pr. sporskiftepakke er nået, og det overstigende beløb er derfor selvbetaling.\",\"\")","v":{"$error":"#REF!"}}]
[]
[]
[null,"Estimeret VEU-godtgørelse",null,{"$f":"D43+D25","v":0}]
[]
[null,"Selvbetaling i kr. (udgifter udover den øvre tilsagnsramme)",null,{"$f":"IF(C51>300,0,MAX(D49+D54+D44+D42+D24+D26-D56,0))","v":{"$error":"#REF!"}}]
[]
[null,"Tilsagnsbeløb i kr.",null,{"$f":"Slutregnskab!J10","v":{"$error":"#REF!"}}]

{"sheet":"Medarbejder 28","index":29,"n_rows":63,"n_cols":6,"rows_kept":63,"cut":false,"hidden":true,"merged":[[62,1,62,2],[60,1,60,2],[16,1,16,2],[33,1,33,2],[58,1,58,2],[46,1,46,2],[34,1,34,2],[22,1,22,2],[23,1,23,2],[24,1,24,2],[25,1,25,2],[27,1,27,2],[28,1,28,2],[29,1,29,2],[30,1,30,2],[31,1,31,2],[8,4,8,5],[21,1,21,2],[9,1,9,2],[9,4,9,5],[10,1,10,2],[11,1,11,3],[12,1,12,3],[14,1,14,3],[17,1,17,2],[18,1,18,2],[19,1,19,2],[20,1,20,2],[1,1,1,3],[3,1,3,3],[5,1,5,2],[6,1,6,2],[8,1,8,2],[7,1,7,2],[32,1,32,2],[48,1,48,2],[55,1,56,2],[55,3,56,3],[47,1,47,2],[35,1,35,2],[36,1,36,2],[37,1,37,2],[38,1,38,2],[39,1,39,2],[40,1,40,2],[41,1,41,2],[42,1,42,2],[43,1,43,2],[45,1,45,2]]}
[]
[null,"Slutregnskab for sporskiftepakken"]
[]
[null,"Oplysninger om medarbejderen"]
[]
[null,"Medarbejderens navn"]
[null,"Medarbejderens lønkompensation fra sporskifte (kr./t.)",null,{"$f":"IF(D8>261,(IF(D11=\"Ja\",260-'Format ark'!D13,260)),IF(D8<=260,IF(D11=\"Ja\",IF(D8<'Format ark'!D13,0,D8-'Format ark'!D13),D8)))","v":0}]
[null,"Medarbejderens timesats (kr./t.)"]
[null,"Medarbejderens højst gennemførte uddannelse",null,null,{"$f":"IF(D9=\"\",\"Husk at vælge medarbejderens højst gennemførte uddannelse.\",\" \")","v":"Husk at vælge medarbejderens højst gennemførte uddannelse."}]
[null,"Har medarbejderen brugt sin uddannelse de senest 5 år?",null,null,{"$f":"IF(D10=\"\",\"Husk at svare på spørgsmålet.\",\" \")","v":"Husk at svare på spørgsmålet."}]
[null,"Medarbejder formodes at være berettiget til at få VEU-godtgørelse ",null,{"$f":"IF(OR(D9=\"Videregående uddannelse\",D9=\"Gymnasial uddannelse\")*AND(D10=\"ja\"),\"Nej\",\"Ja\")","v":"Ja"}]
[null,"Beskriv herunder hvad formålet med den planlagte sporskiftepakke er for medarbejderen:"]
[]
[]
[null,"Aktiviteter"]
[]
[null,"Afklaring, vejledning mv. \nSkriv navn på kursus",null,"Medarbejderens timeforbug (timer)","Evt. deltagerbetaling (kr.)","Giver kurset ret til VEU-godtgørelse?"]
[]
[]
[]
[]
[]
[null,"Samlet antal timer (udregner selv)",null,{"$f":"SUM(D18:D22)","v":0}]
[null,"Samlet lønkompensation udover evt. VEU-godtgørelse (udregner selv)",null,{"$f":"IF(D11=\"Nej\",D23*D7,0)+IF(AND(D11=\"Ja\",F18=\"Ja\"),D18*D7,0)+IF(AND(D11=\"Ja\",F19=\"Ja\"),D19*D7,0)+IF(AND(D11=\"Ja\",F20=\"Ja\"),D20*D7,0)+IF(AND(D11=\"Ja\",F21=\"Ja\"),D21*D7,0)+IF(AND(D11=\"Ja\",F22=\"Ja\"),D22*D7,0)+IF(AND(D11=\"Ja\",F18=\"Nej\"),D18*IF(D8>261,(IF(F18=\"Ja\",260-'Format ark'!D13,260)),IF(D8<=260,IF(F18=\"Ja\",D8-'Format ark'!D13,D8))),0)+IF(AND(D11=\"Ja\",F19=\"Nej\"),D19*IF(D8>261,(IF(F19=\"Ja\",260-'Format ark'!D13,260)),IF(D8<=260,IF(F19=\"Ja\",D8-'Format ark'!D13,D8))),0)+IF(AND(D11=\"Ja\",F20=\"Nej\"),D20*IF(D8>261,(IF(F20=\"Ja\",260-'Format ark'!D13,260)),IF(D8<=260,IF(F20=\"Ja\",D8-'Format ark'!D13,D8))),0)+IF(AND(D11=\"Ja\",F21=\"Nej\"),D21*IF(D8>261,(IF(F21=\"Ja\",260-'Format ark'!D13,260)),IF(D8<=260,IF(F21=\"Ja\",D8-'Format ark'!D13,D8))),0)+IF(AND(D11=\"Ja\",F22=\"Nej\"),D22*IF(D8>261,(IF(F22=\"Ja\",260-'Format ark'!D13,260)),IF(D8<=260,IF(F22=\"Ja\",D8-'Format ark'!D13,D8))),0)","v":0}]
[null,"Estimeret VEU-godtgørelse",null,{"$f":"IF(AND(D11=\"Ja\",F18=\"Ja\"),D18*'Format ark'!D13,0)+IF(AND(D11=\"Ja\",F19=\"Ja\"),D19*'Format ark'!D13,0)+IF(AND(D11=\"Ja\",F20=\"Ja\"),D20*'Format ark'!D13,0)+IF(AND(D11=\"Ja\",F21=\"Ja\"),D21*'Format ark'!D13,0)+IF(AND(D11=\"Ja\",F22=\"Ja\"),D22*'Format ark'!D13,0)","v":0}]
[null,"Samlet deltagerbeltaing (udregner selv)",null,{"$f":"SUM(E18:E22)","v":0}]
[]
[null,"Erhversrettet efteruddannelse\nSkriv navn på efteruddannelse",null,"Medarbejderens timeforbrug (timer)","Evt. deltagerbetaling (kr.)","Giver kurset ret til VEU-godtgørelse?"]
[]
[]
[]
[]
[]
[]
[]
[]
[]
[]
[]
[]
[null,"Samlet antal timer (udregner selv)",null,{"$f":"SUM(D29:D40)","v":0}]
[null,"Samlet lønkompensation udover evt. VEU-godtgørelse (udregner selv)",null,{"$f":"IF(D11=\"Nej\",D41*D7,0)+IF(AND(D11=\"Ja\",F29=\"Ja\"),D29*D7,0)+IF(AND(D11=\"Ja\",F30=\"Ja\"),D30*D7,0)+IF(AND(D11=\"Ja\",F31=\"Ja\"),D31*D7,0)+IF(AND(D11=\"Ja\",F32=\"Ja\"),D32*D7,0)+IF(AND(D11=\"Ja\",F33=\"Ja\"),D33*D7,0)+IF(AND(D11=\"Ja\",F34=\"Ja\"),D34*D7,0)+IF(AND(D11=\"Ja\",F35=\"Ja\"),D35*D7,0)+IF(AND(D11=\"Ja\",F36=\"Ja\"),D36*D7,0)+IF(AND(D11=\"Ja\",F37=\"Ja\"),D37*D7,0)+IF(AND(D11=\"Ja\",F38=\"Ja\"),D38*D7,0)+IF(AND(D11=\"Ja\",F39=\"Ja\"),D39*D7,0)+IF(AND(D11=\"Ja\",F40=\"Ja\"),D40*D7,0)+IF(AND(D11=\"Ja\",F29=\"Nej\"),D29* IF(D8>261,(IF(F29=\"Ja\",260-'Format ark'!D13,260)),IF(D8<=260,IF(F29=\"Ja\",D8-'Format ark'!D13,D8))),0)+IF(AND(D11=\"Ja\",F30=\"Nej\"),D30* IF(D8>261,(IF(F30=\"Ja\",260-'Format ark'!D13,260)),IF(D8<=260,IF(F30=\"Ja\",D8-'Format ark'!D13,D8))),0)+IF(AND(D11=\"Ja\",F31=\"Nej\"),D31* IF(D8>261,(IF(F31=\"Ja\",260-'Format ark'!D13,260)),IF(D8<=260,IF(F31=\"Ja\",D8-'Format ark'!D13,D8))),0)+IF(AND(D11=\"Ja\",F32=\"Nej\"),D32* IF(D8>261,(IF(F32=\"Ja\",260-'Format ark'!D13,260)),IF(D8<=260,IF(F32=\"Ja\",D8-'Format ark'!D13,D8))),0)+IF(AND(D11=\"Ja\",F33=\"Nej\"),D33* IF(D8>261,(IF(F33=\"Ja\",260-'Format ark'!D13,260)),IF(D8<=260,IF(F33=\"Ja\",D8-'Format ark'!D13,D8))),0)+IF(AND(D11=\"Ja\",F34=\"Nej\"),D34* IF(D8>261,(IF(F34=\"Ja\",260-'Format ark'!D13,260)),IF(D8<=260,IF(F34=\"Ja\",D8-'Format ark'!D13,D8))),0)+IF(AND(D11=\"Ja\",F35=\"Nej\"),D35* IF(D8>261,(IF(F35=\"Ja\",260-'Format ark'!D13,260)),IF(D8<=260,IF(F35=\"Ja\",D8-'Format ark'!D13,D8))),0)+IF(AND(D11=\"Ja\",F36=\"Nej\"),D36* IF(D8>261,(IF(F36=\"Ja\",260-'Format ark'!D13,260)),IF(D8<=260,IF(F36=\"Ja\",D8-'Format ark'!D13,D8))),0)+IF(AND(D11=\"Ja\",F37=\"Nej\"),D37* IF(D8>261,(IF(F37=\"Ja\",260-'Format ark'!D13,260)),IF(D8<=260,IF(F37=\"Ja\",D8-'Format ark'!D13,D8))),0)+IF(AND(D11=\"Ja\",F38=\"Nej\"),D38* IF(D8>261,(IF(F38=\"Ja\",260-'Format ark'!D13,260)),IF(D8<=260,IF(F38=\"Ja\",D8-'Format ark'!D13,D8))),0)+IF(AND(D11=\"Ja\",F39=\"Nej\"),D39* IF(D8>261,(IF(F39=\"Ja\",260-'Format ark'!D13,260)),IF(D8<=260,IF(F39=\"Ja\",D8-'Format ark'!D13,D8))),0)+IF(AND(D11=\"Ja\",F40=\"Nej\"),D40* IF(D8>261,(IF(F40=\"Ja\",260-'Format ark'!D13,260)),IF(D8<=260,IF(F40=\"Ja\",D8-'Format ark'!D13,D8))),0)","v":0}]
[null,"Estimeret VEU-godtgørelse",null,{"$f":"IF(AND(D11=\"Ja\",F29=\"Ja\"),D29*'Format ark'!D13,0)+IF(AND(D11=\"Ja\",F30=\"Ja\"),D30*'Format ark'!D13,0)+IF(AND(D11=\"Ja\",F31=\"Ja\"),D31*'Format ark'!D13,0)+IF(AND(D11=\"Ja\",F32=\"Ja\"),D32*('Format ark'!D13),0)+IF(AND(D11=\"Ja\",F33=\"Ja\"),D33*'Format ark'!D13,0)+IF(AND(D11=\"Ja\",F34=\"Ja\"),D34*'Format ark'!D13,0)+IF(AND(D11=\"Ja\",F35=\"Ja\"),D35*'Format ark'!D13,0)+IF(AND(D11=\"Ja\",F36=\"Ja\"),D36*'Format ark'!D13,0)+IF(AND(D11=\"Ja\",F37=\"Ja\"),D37*'Format ark'!D13,0)+IF(AND(D11=\"Ja\",F38=\"Ja\"),D38*'Format ark'!D13,0)+IF(AND(D11=\"Ja\",F39=\"Ja\"),D39*'Format ark'!D13,0)+IF(AND(D11=\"Ja\",F40=\"Ja\"),D40*'Format ark'!D13,0)","v":0}]
[null,"Samlet deltagerbetaling (udregner selv)",null,{"$f":"SUM(E29:E40)","v":0}]
[]
[null,"Praktik"]
[null,"Navn på virksomhed og p-nummer"]
[null,"Medarbejderens timeforbrug",null,null,{"$f":"IF(D48>C51*0.5,\"Praktik må maksimalt udgøre 50% af det samlede tidsforbrug.\",\" \")","v":" "}]
[null,"Samlet lønkompensation for praktikopholdet",null,{"$f":"IF(D48>C51*0.5,\"IKKE MULIGT\",D48*(IF(D8>261,260,D8)))","v":0}]
[]
[null,"Samlet tidsforbrug ",{"$f":"IF(D48+D41+D23>300,\"IKKE MULIGT\",D48+D41+D23)","v":0},{"$f":"IF(C51>300,\"Det maksimale tidsforbrug er 300 timer\",\" \")","v":" "}]
[]
[null,"Tidsforbrug til administration","Antal timer","Beløb"]
[null,"Der kan godtgøres op til 5 timer.",null,{"$f":"IF(C54>5,\"Der kan maksimalt godtgøres 5 timer pr. medarbejder.\",C54*260)","v":0}]
[]
[null,"Samlet tilsagnsramme i kr. (maksimal støtte til sporskiftepakken): ",null,{"$f":"IF(AND(C51>300,D49+D44+D42+D26+D24+D54<D63+1),0,MIN(D49+D44+D42+D26+D24+D54,120000))","v":{"$error":"#REF!"}},{"$f":"IF(D56=120000,\"Det maksimale tilsagn pr. sporskiftepakke er nået, og det overstigende beløb er derfor selvbetaling.\",\"\")","v":{"$error":"#REF!"}}]
[]
[]
[null,"Estimeret VEU-godtgørelse",null,{"$f":"D43+D25","v":0}]
[]
[null,"Selvbetaling i kr. (udgifter udover den øvre tilsagnsramme)",null,{"$f":"IF(C51>300,0,MAX(D49+D54+D44+D42+D24+D26-D56,0))","v":{"$error":"#REF!"}}]
[]
[null,"Tilsagnsbeløb i kr.",null,{"$f":"Slutregnskab!J10","v":{"$error":"#REF!"}}]

{"sheet":"Medarbejder 29","index":30,"n_rows":63,"n_cols":6,"rows_kept":63,"cut":false,"hidden":true,"merged":[[62,1,62,2],[60,1,60,2],[16,1,16,2],[33,1,33,2],[58,1,58,2],[46,1,46,2],[34,1,34,2],[22,1,22,2],[23,1,23,2],[24,1,24,2],[25,1,25,2],[27,1,27,2],[28,1,28,2],[29,1,29,2],[30,1,30,2],[31,1,31,2],[8,4,8,5],[21,1,21,2],[9,1,9,2],[9,4,9,5],[10,1,10,2],[11,1,11,3],[12,1,12,3],[14,1,14,3],[17,1,17,2],[18,1,18,2],[19,1,19,2],[20,1,20,2],[1,1,1,3],[3,1,3,3],[5,1,5,2],[6,1,6,2],[8,1,8,2],[7,1,7,2],[32,1,32,2],[48,1,48,2],[55,1,56,2],[55,3,56,3],[47,1,47,2],[35,1,35,2],[36,1,36,2],[37,1,37,2],[38,1,38,2],[39,1,39,2],[40,1,40,2],[41,1,41,2],[42,1,42,2],[43,1,43,2],[45,1,45,2]]}
[]
[null,"Slutregnskab for sporskiftepakken"]
[]
[null,"Oplysninger om medarbejderen"]
[]
[null,"Medarbejderens navn"]
[null,"Medarbejderens lønkompensation fra sporskifte (kr./t.)",null,{"$f":"IF(D8>261,(IF(D11=\"Ja\",260-'Format ark'!D13,260)),IF(D8<=260,IF(D11=\"Ja\",IF(D8<'Format ark'!D13,0,D8-'Format ark'!D13),D8)))","v":0}]
[null,"Medarbejderens timesats (kr./t.)"]
[null,"Medarbejderens højst gennemførte uddannelse",null,null,{"$f":"IF(D9=\"\",\"Husk at vælge medarbejderens højst gennemførte uddannelse.\",\" \")","v":"Husk at vælge medarbejderens højst gennemførte uddannelse."}]
[null,"Har medarbejderen brugt sin uddannelse de senest 5 år?",null,null,{"$f":"IF(D10=\"\",\"Husk at svare på spørgsmålet.\",\" \")","v":"Husk at svare på spørgsmålet."}]
[null,"Medarbejder formodes at være berettiget til at få VEU-godtgørelse ",null,{"$f":"IF(OR(D9=\"Videregående uddannelse\",D9=\"Gymnasial uddannelse\")*AND(D10=\"ja\"),\"Nej\",\"Ja\")","v":"Ja"}]
[null,"Beskriv herunder hvad formålet med den planlagte sporskiftepakke er for medarbejderen:"]
[]
[]
[null,"Aktiviteter"]
[]
[null,"Afklaring, vejledning mv. \nSkriv navn på kursus",null,"Medarbejderens timeforbug (timer)","Evt. deltagerbetaling (kr.)","Giver kurset ret til VEU-godtgørelse?"]
[]
[]
[]
[]
[]
[null,"Samlet antal timer (udregner selv)",null,{"$f":"SUM(D18:D22)","v":0}]
[null,"Samlet lønkompensation udover evt. VEU-godtgørelse (udregner selv)",null,{"$f":"IF(D11=\"Nej\",D23*D7,0)+IF(AND(D11=\"Ja\",F18=\"Ja\"),D18*D7,0)+IF(AND(D11=\"Ja\",F19=\"Ja\"),D19*D7,0)+IF(AND(D11=\"Ja\",F20=\"Ja\"),D20*D7,0)+IF(AND(D11=\"Ja\",F21=\"Ja\"),D21*D7,0)+IF(AND(D11=\"Ja\",F22=\"Ja\"),D22*D7,0)+IF(AND(D11=\"Ja\",F18=\"Nej\"),D18*IF(D8>261,(IF(F18=\"Ja\",260-'Format ark'!D13,260)),IF(D8<=260,IF(F18=\"Ja\",D8-'Format ark'!D13,D8))),0)+IF(AND(D11=\"Ja\",F19=\"Nej\"),D19*IF(D8>261,(IF(F19=\"Ja\",260-'Format ark'!D13,260)),IF(D8<=260,IF(F19=\"Ja\",D8-'Format ark'!D13,D8))),0)+IF(AND(D11=\"Ja\",F20=\"Nej\"),D20*IF(D8>261,(IF(F20=\"Ja\",260-'Format ark'!D13,260)),IF(D8<=260,IF(F20=\"Ja\",D8-'Format ark'!D13,D8))),0)+IF(AND(D11=\"Ja\",F21=\"Nej\"),D21*IF(D8>261,(IF(F21=\"Ja\",260-'Format ark'!D13,260)),IF(D8<=260,IF(F21=\"Ja\",D8-'Format ark'!D13,D8))),0)+IF(AND(D11=\"Ja\",F22=\"Nej\"),D22*IF(D8>261,(IF(F22=\"Ja\",260-'Format ark'!D13,260)),IF(D8<=260,IF(F22=\"Ja\",D8-'Format ark'!D13,D8))),0)","v":0}]
[null,"Estimeret VEU-godtgørelse",null,{"$f":"IF(AND(D11=\"Ja\",F18=\"Ja\"),D18*'Format ark'!D13,0)+IF(AND(D11=\"Ja\",F19=\"Ja\"),D19*'Format ark'!D13,0)+IF(AND(D11=\"Ja\",F20=\"Ja\"),D20*'Format ark'!D13,0)+IF(AND(D11=\"Ja\",F21=\"Ja\"),D21*'Format ark'!D13,0)+IF(AND(D11=\"Ja\",F22=\"Ja\"),D22*'Format ark'!D13,0)","v":0}]
[null,"Samlet deltagerbeltaing (udregner selv)",null,{"$f":"SUM(E18:E22)","v":0}]
[]
[null,"Erhversrettet efteruddannelse\nSkriv navn på efteruddannelse",null,"Medarbejderens timeforbrug (timer)","Evt. deltagerbetaling (kr.)","Giver kurset ret til VEU-godtgørelse?"]
[]
[]
[]
[]
[]
[]
[]
[]
[]
[]
[]
[]
[null,"Samlet antal timer (udregner selv)",null,{"$f":"SUM(D29:D40)","v":0}]
[null,"Samlet lønkompensation udover evt. VEU-godtgørelse (udregner selv)",null,{"$f":"IF(D11=\"Nej\",D41*D7,0)+IF(AND(D11=\"Ja\",F29=\"Ja\"),D29*D7,0)+IF(AND(D11=\"Ja\",F30=\"Ja\"),D30*D7,0)+IF(AND(D11=\"Ja\",F31=\"Ja\"),D31*D7,0)+IF(AND(D11=\"Ja\",F32=\"Ja\"),D32*D7,0)+IF(AND(D11=\"Ja\",F33=\"Ja\"),D33*D7,0)+IF(AND(D11=\"Ja\",F34=\"Ja\"),D34*D7,0)+IF(AND(D11=\"Ja\",F35=\"Ja\"),D35*D7,0)+IF(AND(D11=\"Ja\",F36=\"Ja\"),D36*D7,0)+IF(AND(D11=\"Ja\",F37=\"Ja\"),D37*D7,0)+IF(AND(D11=\"Ja\",F38=\"Ja\"),D38*D7,0)+IF(AND(D11=\"Ja\",F39=\"Ja\"),D39*D7,0)+IF(AND(D11=\"Ja\",F40=\"Ja\"),D40*D7,0)+IF(AND(D11=\"Ja\",F29=\"Nej\"),D29* IF(D8>261,(IF(F29=\"Ja\",260-'Format ark'!D13,260)),IF(D8<=260,IF(F29=\"Ja\",D8-'Format ark'!D13,D8))),0)+IF(AND(D11=\"Ja\",F30=\"Nej\"),D30* IF(D8>261,(IF(F30=\"Ja\",260-'Format ark'!D13,260)),IF(D8<=260,IF(F30=\"Ja\",D8-'Format ark'!D13,D8))),0)+IF(AND(D11=\"Ja\",F31=\"Nej\"),D31* IF(D8>261,(IF(F31=\"Ja\",260-'Format ark'!D13,260)),IF(D8<=260,IF(F31=\"Ja\",D8-'Format ark'!D13,D8))),0)+IF(AND(D11=\"Ja\",F32=\"Nej\"),D32* IF(D8>261,(IF(F32=\"Ja\",260-'Format ark'!D13,260)),IF(D8<=260,IF(F32=\"Ja\",D8-'Format ark'!D13,D8))),0)+IF(AND(D11=\"Ja\",F33=\"Nej\"),D33* IF(D8>261,(IF(F33=\"Ja\",260-'Format ark'!D13,260)),IF(D8<=260,IF(F33=\"Ja\",D8-'Format ark'!D13,D8))),0)+IF(AND(D11=\"Ja\",F34=\"Nej\"),D34* IF(D8>261,(IF(F34=\"Ja\",260-'Format ark'!D13,260)),IF(D8<=260,IF(F34=\"Ja\",D8-'Format ark'!D13,D8))),0)+IF(AND(D11=\"Ja\",F35=\"Nej\"),D35* IF(D8>261,(IF(F35=\"Ja\",260-'Format ark'!D13,260)),IF(D8<=260,IF(F35=\"Ja\",D8-'Format ark'!D13,D8))),0)+IF(AND(D11=\"Ja\",F36=\"Nej\"),D36* IF(D8>261,(IF(F36=\"Ja\",260-'Format ark'!D13,260)),IF(D8<=260,IF(F36=\"Ja\",D8-'Format ark'!D13,D8))),0)+IF(AND(D11=\"Ja\",F37=\"Nej\"),D37* IF(D8>261,(IF(F37=\"Ja\",260-'Format ark'!D13,260)),IF(D8<=260,IF(F37=\"Ja\",D8-'Format ark'!D13,D8))),0)+IF(AND(D11=\"Ja\",F38=\"Nej\"),D38* IF(D8>261,(IF(F38=\"Ja\",260-'Format ark'!D13,260)),IF(D8<=260,IF(F38=\"Ja\",D8-'Format ark'!D13,D8))),0)+IF(AND(D11=\"Ja\",F39=\"Nej\"),D39* IF(D8>261,(IF(F39=\"Ja\",260-'Format ark'!D13,260)),IF(D8<=260,IF(F39=\"Ja\",D8-'Format ark'!D13,D8))),0)+IF(AND(D11=\"Ja\",F40=\"Nej\"),D40* IF(D8>261,(IF(F40=\"Ja\",260-'Format ark'!D13,260)),IF(D8<=260,IF(F40=\"Ja\",D8-'Format ark'!D13,D8))),0)","v":0}]
[null,"Estimeret VEU-godtgørelse",null,{"$f":"IF(AND(D11=\"Ja\",F29=\"Ja\"),D29*'Format ark'!D13,0)+IF(AND(D11=\"Ja\",F30=\"Ja\"),D30*'Format ark'!D13,0)+IF(AND(D11=\"Ja\",F31=\"Ja\"),D31*'Format ark'!D13,0)+IF(AND(D11=\"Ja\",F32=\"Ja\"),D32*('Format ark'!D13),0)+IF(AND(D11=\"Ja\",F33=\"Ja\"),D33*'Format ark'!D13,0)+IF(AND(D11=\"Ja\",F34=\"Ja\"),D34*'Format ark'!D13,0)+IF(AND(D11=\"Ja\",F35=\"Ja\"),D35*'Format ark'!D13,0)+IF(AND(D11=\"Ja\",F36=\"Ja\"),D36*'Format ark'!D13,0)+IF(AND(D11=\"Ja\",F37=\"Ja\"),D37*'Format ark'!D13,0)+IF(AND(D11=\"Ja\",F38=\"Ja\"),D38*'Format ark'!D13,0)+IF(AND(D11=\"Ja\",F39=\"Ja\"),D39*'Format ark'!D13,0)+IF(AND(D11=\"Ja\",F40=\"Ja\"),D40*'Format ark'!D13,0)","v":0}]
[null,"Samlet deltagerbetaling (udregner selv)",null,{"$f":"SUM(E29:E40)","v":0}]
[]
[null,"Praktik"]
[null,"Navn på virksomhed og p-nummer"]
[null,"Medarbejderens timeforbrug",null,null,{"$f":"IF(D48>C51*0.5,\"Praktik må maksimalt udgøre 50% af det samlede tidsforbrug.\",\" \")","v":" "}]
[null,"Samlet lønkompensation for praktikopholdet",null,{"$f":"IF(D48>C51*0.5,\"IKKE MULIGT\",D48*(IF(D8>261,260,D8)))","v":0}]
[]
[null,"Samlet tidsforbrug ",{"$f":"IF(D48+D41+D23>300,\"IKKE MULIGT\",D48+D41+D23)","v":0},{"$f":"IF(C51>300,\"Det maksimale tidsforbrug er 300 timer\",\" \")","v":" "}]
[]
[null,"Tidsforbrug til administration","Antal timer","Beløb"]
[null,"Der kan godtgøres op til 5 timer.",null,{"$f":"IF(C54>5,\"Der kan maksimalt godtgøres 5 timer pr. medarbejder.\",C54*260)","v":0}]
[]
[null,"Samlet tilsagnsramme i kr. (maksimal støtte til sporskiftepakken): ",null,{"$f":"IF(AND(C51>300,D49+D44+D42+D26+D24+D54<D63+1),0,MIN(D49+D44+D42+D26+D24+D54,120000))","v":{"$error":"#REF!"}},{"$f":"IF(D56=120000,\"Det maksimale tilsagn pr. sporskiftepakke er nået, og det overstigende beløb er derfor selvbetaling.\",\"\")","v":{"$error":"#REF!"}}]
[]
[]
[null,"Estimeret VEU-godtgørelse",null,{"$f":"D43+D25","v":0}]
[]
[null,"Selvbetaling i kr. (udgifter udover den øvre tilsagnsramme)",null,{"$f":"IF(C51>300,0,MAX(D49+D54+D44+D42+D24+D26-D56,0))","v":{"$error":"#REF!"}}]
[]
[null,"Tilsagnsbeløb i kr.",null,{"$f":"Slutregnskab!J10","v":{"$error":"#REF!"}}]

{"sheet":"Medarbejder 30","index":31,"n_rows":63,"n_cols":6,"rows_kept":63,"cut":false,"hidden":true,"merged":[[62,1,62,2],[60,1,60,2],[16,1,16,2],[33,1,33,2],[58,1,58,2],[46,1,46,2],[34,1,34,2],[22,1,22,2],[23,1,23,2],[24,1,24,2],[25,1,25,2],[27,1,27,2],[28,1,28,2],[29,1,29,2],[30,1,30,2],[31,1,31,2],[8,4,8,5],[21,1,21,2],[9,1,9,2],[9,4,9,5],[10,1,10,2],[11,1,11,3],[12,1,12,3],[14,1,14,3],[17,1,17,2],[18,1,18,2],[19,1,19,2],[20,1,20,2],[1,1,1,3],[3,1,3,3],[5,1,5,2],[6,1,6,2],[8,1,8,2],[7,1,7,2],[32,1,32,2],[48,1,48,2],[55,1,56,2],[55,3,56,3],[47,1,47,2],[35,1,35,2],[36,1,36,2],[37,1,37,2],[38,1,38,2],[39,1,39,2],[40,1,40,2],[41,1,41,2],[42,1,42,2],[43,1,43,2],[45,1,45,2]]}
[]
[null,"Slutregnskab for sporskiftepakken"]
[]
[null,"Oplysninger om medarbejderen"]
[]
[null,"Medarbejderens navn"]
[null,"Medarbejderens lønkompensation fra sporskifte (kr./t.)",null,{"$f":"IF(D8>261,(IF(D11=\"Ja\",260-'Format ark'!D13,260)),IF(D8<=260,IF(D11=\"Ja\",IF(D8<'Format ark'!D13,0,D8-'Format ark'!D13),D8)))","v":0}]
[null,"Medarbejderens timesats (kr./t.)"]
[null,"Medarbejderens højst gennemførte uddannelse",null,null,{"$f":"IF(D9=\"\",\"Husk at vælge medarbejderens højst gennemførte uddannelse.\",\" \")","v":"Husk at vælge medarbejderens højst gennemførte uddannelse."}]
[null,"Har medarbejderen brugt sin uddannelse de senest 5 år?",null,null,{"$f":"IF(D10=\"\",\"Husk at svare på spørgsmålet.\",\" \")","v":"Husk at svare på spørgsmålet."}]
[null,"Medarbejder formodes at være berettiget til at få VEU-godtgørelse ",null,{"$f":"IF(OR(D9=\"Videregående uddannelse\",D9=\"Gymnasial uddannelse\")*AND(D10=\"ja\"),\"Nej\",\"Ja\")","v":"Ja"}]
[null,"Beskriv herunder hvad formålet med den planlagte sporskiftepakke er for medarbejderen:"]
[]
[]
[null,"Aktiviteter"]
[]
[null,"Afklaring, vejledning mv. \nSkriv navn på kursus",null,"Medarbejderens timeforbug (timer)","Evt. deltagerbetaling (kr.)","Giver kurset ret til VEU-godtgørelse?"]
[]
[]
[]
[]
[]
[null,"Samlet antal timer (udregner selv)",null,{"$f":"SUM(D18:D22)","v":0}]
[null,"Samlet lønkompensation udover evt. VEU-godtgørelse (udregner selv)",null,{"$f":"IF(D11=\"Nej\",D23*D7,0)+IF(AND(D11=\"Ja\",F18=\"Ja\"),D18*D7,0)+IF(AND(D11=\"Ja\",F19=\"Ja\"),D19*D7,0)+IF(AND(D11=\"Ja\",F20=\"Ja\"),D20*D7,0)+IF(AND(D11=\"Ja\",F21=\"Ja\"),D21*D7,0)+IF(AND(D11=\"Ja\",F22=\"Ja\"),D22*D7,0)+IF(AND(D11=\"Ja\",F18=\"Nej\"),D18*IF(D8>261,(IF(F18=\"Ja\",260-'Format ark'!D13,260)),IF(D8<=260,IF(F18=\"Ja\",D8-'Format ark'!D13,D8))),0)+IF(AND(D11=\"Ja\",F19=\"Nej\"),D19*IF(D8>261,(IF(F19=\"Ja\",260-'Format ark'!D13,260)),IF(D8<=260,IF(F19=\"Ja\",D8-'Format ark'!D13,D8))),0)+IF(AND(D11=\"Ja\",F20=\"Nej\"),D20*IF(D8>261,(IF(F20=\"Ja\",260-'Format ark'!D13,260)),IF(D8<=260,IF(F20=\"Ja\",D8-'Format ark'!D13,D8))),0)+IF(AND(D11=\"Ja\",F21=\"Nej\"),D21*IF(D8>261,(IF(F21=\"Ja\",260-'Format ark'!D13,260)),IF(D8<=260,IF(F21=\"Ja\",D8-'Format ark'!D13,D8))),0)+IF(AND(D11=\"Ja\",F22=\"Nej\"),D22*IF(D8>261,(IF(F22=\"Ja\",260-'Format ark'!D13,260)),IF(D8<=260,IF(F22=\"Ja\",D8-'Format ark'!D13,D8))),0)","v":0}]
[null,"Estimeret VEU-godtgørelse",null,{"$f":"IF(AND(D11=\"Ja\",F18=\"Ja\"),D18*'Format ark'!D13,0)+IF(AND(D11=\"Ja\",F19=\"Ja\"),D19*'Format ark'!D13,0)+IF(AND(D11=\"Ja\",F20=\"Ja\"),D20*'Format ark'!D13,0)+IF(AND(D11=\"Ja\",F21=\"Ja\"),D21*'Format ark'!D13,0)+IF(AND(D11=\"Ja\",F22=\"Ja\"),D22*'Format ark'!D13,0)","v":0}]
[null,"Samlet deltagerbeltaing (udregner selv)",null,{"$f":"SUM(E18:E22)","v":0}]
[]
[null,"Erhversrettet efteruddannelse\nSkriv navn på efteruddannelse",null,"Medarbejderens timeforbrug (timer)","Evt. deltagerbetaling (kr.)","Giver kurset ret til VEU-godtgørelse?"]
[]
[]
[]
[]
[]
[]
[]
[]
[]
[]
[]
[]
[null,"Samlet antal timer (udregner selv)",null,{"$f":"SUM(D29:D40)","v":0}]
[null,"Samlet lønkompensation udover evt. VEU-godtgørelse (udregner selv)",null,{"$f":"IF(D11=\"Nej\",D41*D7,0)+IF(AND(D11=\"Ja\",F29=\"Ja\"),D29*D7,0)+IF(AND(D11=\"Ja\",F30=\"Ja\"),D30*D7,0)+IF(AND(D11=\"Ja\",F31=\"Ja\"),D31*D7,0)+IF(AND(D11=\"Ja\",F32=\"Ja\"),D32*D7,0)+IF(AND(D11=\"Ja\",F33=\"Ja\"),D33*D7,0)+IF(AND(D11=\"Ja\",F34=\"Ja\"),D34*D7,0)+IF(AND(D11=\"Ja\",F35=\"Ja\"),D35*D7,0)+IF(AND(D11=\"Ja\",F36=\"Ja\"),D36*D7,0)+IF(AND(D11=\"Ja\",F37=\"Ja\"),D37*D7,0)+IF(AND(D11=\"Ja\",F38=\"Ja\"),D38*D7,0)+IF(AND(D11=\"Ja\",F39=\"Ja\"),D39*D7,0)+IF(AND(D11=\"Ja\",F40=\"Ja\"),D40*D7,0)+IF(AND(D11=\"Ja\",F29=\"Nej\"),D29* IF(D8>261,(IF(F29=\"Ja\",260-'Format ark'!D13,260)),IF(D8<=260,IF(F29=\"Ja\",D8-'Format ark'!D13,D8))),0)+IF(AND(D11=\"Ja\",F30=\"Nej\"),D30* IF(D8>261,(IF(F30=\"Ja\",260-'Format ark'!D13,260)),IF(D8<=260,IF(F30=\"Ja\",D8-'Format ark'!D13,D8))),0)+IF(AND(D11=\"Ja\",F31=\"Nej\"),D31* IF(D8>261,(IF(F31=\"Ja\",260-'Format ark'!D13,260)),IF(D8<=260,IF(F31=\"Ja\",D8-'Format ark'!D13,D8))),0)+IF(AND(D11=\"Ja\",F32=\"Nej\"),D32* IF(D8>261,(IF(F32=\"Ja\",260-'Format ark'!D13,260)),IF(D8<=260,IF(F32=\"Ja\",D8-'Format ark'!D13,D8))),0)+IF(AND(D11=\"Ja\",F33=\"Nej\"),D33* IF(D8>261,(IF(F33=\"Ja\",260-'Format ark'!D13,260)),IF(D8<=260,IF(F33=\"Ja\",D8-'Format ark'!D13,D8))),0)+IF(AND(D11=\"Ja\",F34=\"Nej\"),D34* IF(D8>261,(IF(F34=\"Ja\",260-'Format ark'!D13,260)),IF(D8<=260,IF(F34=\"Ja\",D8-'Format ark'!D13,D8))),0)+IF(AND(D11=\"Ja\",F35=\"Nej\"),D35* IF(D8>261,(IF(F35=\"Ja\",260-'Format ark'!D13,260)),IF(D8<=260,IF(F35=\"Ja\",D8-'Format ark'!D13,D8))),0)+IF(AND(D11=\"Ja\",F36=\"Nej\"),D36* IF(D8>261,(IF(F36=\"Ja\",260-'Format ark'!D13,260)),IF(D8<=260,IF(F36=\"Ja\",D8-'Format ark'!D13,D8))),0)+IF(AND(D11=\"Ja\",F37=\"Nej\"),D37* IF(D8>261,(IF(F37=\"Ja\",260-'Format ark'!D13,260)),IF(D8<=260,IF(F37=\"Ja\",D8-'Format ark'!D13,D8))),0)+IF(AND(D11=\"Ja\",F38=\"Nej\"),D38* IF(D8>261,(IF(F38=\"Ja\",260-'Format ark'!D13,260)),IF(D8<=260,IF(F38=\"Ja\",D8-'Format ark'!D13,D8))),0)+IF(AND(D11=\"Ja\",F39=\"Nej\"),D39* IF(D8>261,(IF(F39=\"Ja\",260-'Format ark'!D13,260)),IF(D8<=260,IF(F39=\"Ja\",D8-'Format ark'!D13,D8))),0)+IF(AND(D11=\"Ja\",F40=\"Nej\"),D40* IF(D8>261,(IF(F40=\"Ja\",260-'Format ark'!D13,260)),IF(D8<=260,IF(F40=\"Ja\",D8-'Format ark'!D13,D8))),0)","v":0}]
[null,"Estimeret VEU-godtgørelse",null,{"$f":"IF(AND(D11=\"Ja\",F29=\"Ja\"),D29*'Format ark'!D13,0)+IF(AND(D11=\"Ja\",F30=\"Ja\"),D30*'Format ark'!D13,0)+IF(AND(D11=\"Ja\",F31=\"Ja\"),D31*'Format ark'!D13,0)+IF(AND(D11=\"Ja\",F32=\"Ja\"),D32*('Format ark'!D13),0)+IF(AND(D11=\"Ja\",F33=\"Ja\"),D33*'Format ark'!D13,0)+IF(AND(D11=\"Ja\",F34=\"Ja\"),D34*'Format ark'!D13,0)+IF(AND(D11=\"Ja\",F35=\"Ja\"),D35*'Format ark'!D13,0)+IF(AND(D11=\"Ja\",F36=\"Ja\"),D36*'Format ark'!D13,0)+IF(AND(D11=\"Ja\",F37=\"Ja\"),D37*'Format ark'!D13,0)+IF(AND(D11=\"Ja\",F38=\"Ja\"),D38*'Format ark'!D13,0)+IF(AND(D11=\"Ja\",F39=\"Ja\"),D39*'Format ark'!D13,0)+IF(AND(D11=\"Ja\",F40=\"Ja\"),D40*'Format ark'!D13,0)","v":0}]
[null,"Samlet deltagerbetaling (udregner selv)",null,{"$f":"SUM(E29:E40)","v":0}]
[]
[null,"Praktik"]
[null,"Navn på virksomhed og p-nummer"]
[null,"Medarbejderens timeforbrug",null,null,{"$f":"IF(D48>C51*0.5,\"Praktik må maksimalt udgøre 50% af det samlede tidsforbrug.\",\" \")","v":" "}]
[null,"Samlet lønkompensation for praktikopholdet",null,{"$f":"IF(D48>C51*0.5,\"IKKE MULIGT\",D48*(IF(D8>261,260,D8)))","v":0}]
[]
[null,"Samlet tidsforbrug ",{"$f":"IF(D48+D41+D23>300,\"IKKE MULIGT\",D48+D41+D23)","v":0},{"$f":"IF(C51>300,\"Det maksimale tidsforbrug er 300 timer\",\" \")","v":" "}]
[]
[null,"Tidsforbrug til administration","Antal timer","Beløb"]
[null,"Der kan godtgøres op til 5 timer.",null,{"$f":"IF(C54>5,\"Der kan maksimalt godtgøres 5 timer pr. medarbejder.\",C54*260)","v":0}]
[]
[null,"Samlet tilsagnsramme i kr. (maksimal støtte til sporskiftepakken): ",null,{"$f":"IF(AND(C51>300,D49+D44+D42+D26+D24+D54<D63+1),0,MIN(D49+D44+D42+D26+D24+D54,120000))","v":{"$error":"#REF!"}},{"$f":"IF(D56=120000,\"Det maksimale tilsagn pr. sporskiftepakke er nået, og det overstigende beløb er derfor selvbetaling.\",\"\")","v":{"$error":"#REF!"}}]
[]
[]
[null,"Estimeret VEU-godtgørelse",null,{"$f":"D43+D25","v":0}]
[]
[null,"Selvbetaling i kr. (udgifter udover den øvre tilsagnsramme)",null,{"$f":"IF(C51>300,0,MAX(D49+D54+D44+D42+D24+D26-D56,0))","v":{"$error":"#REF!"}}]
[]
[null,"Tilsagnsbeløb i kr.",null,{"$f":"Slutregnskab!J10","v":{"$error":"#REF!"}}]

{"sheet":"Slutregnskab","index":32,"n_rows":42,"n_cols":11,"rows_kept":42,"cut":false,"hidden":true,"merged":[[22,1,22,8],[23,1,23,8],[40,6,40,7],[37,1,37,3],[40,1,40,3],[25,1,25,8],[3,8,3,9],[17,1,17,2],[15,1,15,2],[0,4,1,5],[13,1,13,2]]}
[{"$f":"SUM(I9:I10)","v":0},null,null,null,"Slutregnskab for sporskiftepakken"]
[{"$f":"I10","v":0}]
[{"$f":"LEN(C5)","v":{"$error":"#REF!"}}]
[{"$f":"LEN(C6)","v":{"$error":"#REF!"}},"Virksomhedsnavn",{"$f":"Budget!#REF!","v":{"$error":"#REF!"}},null,null,null,null,null,"Projekt periode"]
[null,"P-nummer",{"$f":"Budget!#REF!","v":{"$error":"#REF!"}},null,null,null,null,null,"Fra:",null,{"$f":"IF(J5=\"\",\"Husk at indsætte startdato\",\"\")","v":"Husk at indsætte startdato"}]
[null,"CVR-nummer",{"$f":"Budget!#REF!","v":{"$error":"#REF!"}},null,null,null,null,null,"Til:",null,{"$f":"IF(J6=\"\",\"Husk at indsætte slutdato\",\"\")","v":"Husk at indsætte slutdato"}]
[]
[null,"Medarbejdere","Berretiget til VEU-godtgørelse","Medarbejderens lønkompensation fra sporskifte (kr./t.)","Samlede udgifter brugt på afklaring, vejledning og erhvervsrettet efteruddannelse","Deltagerbetaling alle kurser","Samlede udgifter brugt til praktikophold","Administrationsbidrag","Samlede udgifter ","Tilsagnsbeløb"]
[]
[null,"Revision",null,null,null,null,null,null,null,{"$f":"Budget!#REF!","v":{"$error":"#REF!"}},{"$f":"IF(AND(I12>500000,I10=0),\"Da det samlede regnskab overstiger 500.000 kr. skal der tilføjes revision\",\"\")","v":""}]
[null,"Justeret for VEU",null,null,null,null,null,null,{"$f":"D14-D18","v":0}]
[null,"Samlet støttebeløb",null,null,null,null,null,null,{"$f":"SUM(I9:I11)","v":0},{"$f":"SUM(J9:J11)","v":{"$error":"#REF!"}}]
[]
[null,"Estimeret VEU-godtgørelse:",null,{"$f":"'Medarbejder 1'!D59","v":0}]
[]
[null,"Samlet selvbetaling i kr. (udgifter udover den øvre tilsagnsramme)",null,{"$f":"'Medarbejder 1'!D61","v":{"$error":"#REF!"}}]
[]
[null,"Realiseret VEU-godtgørelse*",null,null,{"$f":"IF(D18=\"\",\"Husk at indsætte beløb\",\"\")","v":"Husk at indsætte beløb"}]
[]
[null,"*Det bemærkes, at VEU-godtgørelsen er baseret på dagpengesatsen og derfor kan varierer fra år til år."]
[null,"I 2018 var satsen 116 kr/t. og i 2019 er satsen 117,7 kr/t"]
[]
[null,"Ledelseserklæring"]
[null,"Ledelseserklæringen knytter sig til det endelige projektregnskab og er underskrevet af den økonomisk ansvarlige i den tilskudsansvarlige organisation. "]
[]
[null,"Ved krav om revisorpåtegning af regnskabet er erklæringen underskrevet af den projektansvarlige / den økonomisk ansvarlige i den tilskudsansvarlige organisation."]
[]
[null,"Efter projektets bedste overbevisning bekræfter undertegnede hermed følgende forhold:"]
[]
[null,"1) At tilskuddet er anvendt til formålet og de poster, som fremgår af regnskabet"]
[null,"2) At samtlige transaktioner, herunder alle indtægter og omkostninger for projektet, er medtaget i projektregnskabet. "]
[null,"3) At budget og regskab er periodiseret korrekt"]
[null,"4) At projektet er afsluttet og at udgifterne er afholdt i den periode, der fremgår af regnskabet."]
[null,"5) At tilskudsbetingelserne og forudsætningerne for tilskuddet er overholdt"]
[null,"6) At der er taget økonomiske hensyn ved projektets gennemførelse"]
[null,"7) At projektet har oplyst om formodede og konstaterede besvigelser"]
[]
[]
[null,"Navn på projektansvarlig"]
[]
[]
[null,"Underskrift (projektansvarlig)",null,null,null,null,"Dato"]

{"sheet":"Færdige regnskab","index":33,"n_rows":43,"n_cols":11,"rows_kept":43,"cut":false,"hidden":true,"merged":[[23,1,23,8],[24,1,24,8],[38,1,38,3],[41,1,41,3],[41,6,41,7],[3,8,3,9],[18,1,18,2],[0,4,1,5],[14,1,14,2],[16,1,16,2]]}
[{"$f":"SUM(I10:I11)","v":0},null,null,null,"Slutregnskab for sporskiftepakken"]
[{"$f":"I11","v":0}]
[{"$f":"LEN(C5)","v":0}]
[{"$f":"LEN(C6)","v":0},"Virksomhedsnavn",null,null,null,null,null,null,"Projekt periode"]
[null,"P-nummer",null,null,null,null,null,null,"Fra:"]
[null,"CVR-nummer",null,null,null,null,null,null,"Til:"]
[]
[null,"Medarbejdere","Berretiget til VEU-godtgørelse","Medarbejderens lønkompensation fra sporskifte (kr./t.)","Samlede udgifter brugt på afklaring, vejledning og erhvervsrettet efteruddannelse","Deltagerbetaling alle kurser","Samlede udgifter brugt til praktikophold","Administrationsbidrag","Samlede udgifter ","Tilsagnsbeløb"]
[null,"Medarbejder 1","Ja",null,31968,3540,0,1300,36808,36808]
[]
[null,"Revision",null,null,null,null,null,null,null,0,{"$f":"IF(AND(I13>500000,I11=0),\"Da det samlede regnskab overstiger 500.000 kr. skal der tilføjes revision\",\"\")","v":""}]
[]
[null,"Samlet støttebeløb",null,null,null,null,null,null,0,0]
[]
[null,"Estimeret VEU-godtgørelse:",null,25752]
[]
[null,"Samlet selvbetaling i kr. (udgifter udover den øvre tilsagnsramme)",null,0]
[]
[null,"Realiseret VEU-godtgørelse*"]
[]
[null,"*Det bemærkes, at VEU-godtgørelsen er baseret på dagpengesatsen og derfor kan varierer fra år til år."]
[null,"I 2018 var satsen 116 kr/t. og i 2019 er satsen 117,7 kr/t"]
[]
[null,"Ledelseserklæring"]
[null,"Ledelseserklæringen knytter sig til det endelige projektregnskab og er underskrevet af den økonomisk ansvarlige i den tilskudsansvarlige organisation. \n\n"]
[]
[null,"Ved krav om revisorpåtegning af regnskabet er erklæringen underskrevet af den projektansvarlige / den økonomisk ansvarlige i den tilskudsansvarlige organisation."]
[]
[null,"Efter projektets bedste overbevisning bekræfter undertegnede hermed følgende forhold:"]
[]
[null,"1) At tilskuddet er anvendt til formålet og de poster, som fremgår af regnskabet"]
[null,"2) At samtlige transaktioner, herunder alle indtægter og omkostninger for projektet, er medtaget i projektregnskabet. "]
[null,"3) At budget og regskab er periodiseret korrekt"]
[null,"4) At projektet er afsluttet og at udgifterne er afholdt i den periode, der fremgår af regnskabet."]
[null,"5) At tilskudsbetingelserne og forudsætningerne for tilskuddet er overholdt"]
[null,"6) At der er taget økonomiske hensyn ved projektets gennemførelse"]
[null,"7) At projektet har oplyst om formodede og konstaterede besvigelser"]
[]
[]
[null,"Navn på projektansvarlig"]
[]
[]
[null,"Underskrift (projektansvarlig)",null,null,null,null,"Dato"]

{"sheet":"Format ark","index":34,"n_rows":13,"n_cols":4,"rows_kept":13,"cut":false,"hidden":true,"merged":[]}
[]
[null,null,"Grundskole uddannelse","Ja"]
[null,null,"Erhvervsfaglig uddannelse","Nej"]
[null,null,"Gymnasial uddannelse"]
[null,null,"Videregående uddannelse"]
[]
[null,null,"Alle ark er beskyttet ved hjælp af kode: STAR"]
[null,null,"Dette er med store bogstaver og bør indtastes i alle ark for at fjerne denne beskyttelse"]
[null,null,"Budgetarket er dog som det eneste beskyttet med kode \"TOK\""]
[null,null,"Dette skyldes at denne kode er synlig i VBA-koden."]
[]
[]
[null,null,"VEU godtgørelse",{"$f":"IF(Vejledning!M15=2018,116,IF(Vejledning!M15=2019,117.7,IF(Vejledning!M15=2020,119.05,IF(Vejledning!M15=2021,120.54,0))))","v":0}]